program: Gaussian 09
title: 000260922
version: EM64L-G09RevD.01
frameworkgroup: C1[X(C8H8N2O4)]
method: RPBEPBE
basis: SDD
operation: Freq
keyword: #pfreq=noraman
keyword: PBEPBE/SDD
title: #p freq=noraman PBEPBE/SDD
converged: NO YES NO NO
title: Mulliken charges:
elementType: O O O O N N C C C C C C C C H H H H H H H H
charge: -0.427679 -0.329167 -0.353732 -0.378432 -0.469777 -0.352883 0.336684 0.044899 -0.327921 -0.298365 -0.209851 -0.247330 0.165830 0.315836 0.316847 0.275359 0.358479 0.234069 0.236438 0.334706 0.390117 0.385873
chargesum: 0.00000
title: Mulliken charges with hydrogens summed into heavy atoms:
elementType: O O O O N N C C C C C C C C
charge: -0.037561 -0.329167 -0.353732 0.007441 -0.111298 -0.018177 0.336684 0.044899 -0.011074 -0.023006 0.024219 -0.010892 0.165830 0.315836
polarizability: 1.87896915e+02 -8.87536667e+00 1.47841761e+02 -3.87798209e-01 7.30642065e-02 4.56049708e+01
1716.lowfreq: -9.5654 -5.9503 -0.0008 -0.0005 0.0002 2.2153 42.6025 56.4539 80.0926
frequency: 42.5816 56.4535 80.0918 110.3532 111.8915 145.6001 222.8252 244.3764 268.6080 283.5812 309.3240 354.0620 413.6357 419.4764 444.9673 512.0692 522.7870 579.0095 598.1465 610.6123 682.3940 684.9654 728.8015 755.0772 770.9261 786.8067 841.7489 878.9466 900.1351 966.7113 979.7831 1007.7692 1018.2830 1039.6632 1055.1405 1117.2999 1166.0649 1179.1349 1223.5634 1248.2291 1316.4976 1332.9700 1362.3962 1392.6677 1440.4273 1459.4454 1493.2456 1530.9972 1579.9292 1584.7889 1620.4127 1650.6052 3139.0733 3159.9110 3180.7157 3181.3534 3188.3552 3255.8087 3532.2697 3611.5562
redmass: 4.5550 7.9233 7.5312 6.7067 4.7340 4.9300 6.4351 2.1857 3.0836 3.9903 8.3759 7.8100 8.0957 3.1004 1.1620 6.8742 3.1993 1.1944 5.3181 6.4533 5.6457 4.4554 5.7271 2.6590 5.6690 1.6327 6.3321 1.1433 1.4024 6.5060 1.3629 1.3195 5.5572 2.4810 4.2450 1.7642 1.6348 1.1176 1.4514 1.7598 1.8652 2.4664 2.1286 8.9837 2.6312 2.4869 2.0192 3.9172 4.7807 4.7053 4.6624 2.1833 1.0876 1.0917 1.0878 1.0911 1.0966 1.0637 1.0642 1.0823
irintensity: 26.7735 0.7904 29.2270 1.3274 9.9461 5.1335 4.5893 73.7835 27.8276 30.2176 0.1738 16.8165 9.6790 7.4504 154.2848 11.2576 22.1797 117.7496 40.5602 18.6940 41.0036 27.7235 1.4059 25.3191 0.6670 60.0072 1.6306 131.9427 10.3738 105.1131 3.7971 3.4175 205.8669 2.7959 150.6783 128.1297 135.9892 2.1824 13.0986 10.1135 5.9805 78.7229 620.4258 28.1864 31.6625 4.0899 85.9261 472.4875 42.4253 326.3901 229.8065 66.5562 9.7366 11.4824 118.3342 103.8930 13.6443 35.7709 71.0317 89.7045
temp: 298.150 k
press: 1.00000 atm
elementType: 8 8 8 8 7 7 6 6 6 6 6 6 6 6 1 1 1 1 1 1 1 1
symmnumber: 1
zpe: 414956.6 jmol-1
zpe.correction: 0.158049 hartree
zpe.thermalcorrener: 0.171013 hartree
zpe.thermalcorrenthalpy: 0.171957 hartree
zpe.thermalcorrgfe: 0.117714 hartree
zpe.sumelectzpe: -719.017950 hartree
zpe.sumelectthermal: -719.004985 hartree
zpe.sumelectthermalent: -719.004041 hartree
zpe.sumelectthermalfe: -719.058285 hartree
dipole: -3.1536 -1.4265 0.2868
dipole: 3.4731
quadrupole: -82.5989 -70.1411 -84.1570
quadrupole: -1.0691 0.8336 -0.4701
quadrupole: -3.6332 8.8245 -5.1913 -1.0691 0.8336 -0.4701
hfenergy: -719.1759985 hartree
pointgroup: C01 [X(C8H8N2O4)]
dipole: -1.2375701 -0.5488198 0.1852446 debye
dipolederiv: -1.204487 -0.6841764 0.0632119 -0.5710936 -0.6310477 0.0351125 0.0600466 0.0411725 -0.4203457 -0.7481309 0.2393698 0.0079306 0.0587038 -1.0607129 0.0248147 0.0161225 0.0191399 -0.3562802 -0.8492815 -0.1357617 0.0170041 -0.2116559 -0.913987 0.0249891 0.021626 0.0315144 -0.3882286 -0.8216144 0.158949 0.0358208 -0.1864769 -0.1491746 0.0000493 -0.0547973 0.0122206 -0.3497977 -2.2787361 0.1500292 0.0836318 0.0486553 -0.4637466 0.0161851 0.0591292 0.0081958 -0.2985311 -0.1892259 0.1570033 0.0017998 0.8605679 -0.5818381 -0.0900674 0.1631837 -0.1353901 -0.4142889 1.3362312 -0.1174718 -0.0480749 -1.0477081 0.459087 0.0294653 -0.0068814 -0.0079581 0.1144253 -0.3403713 0.1205498 0.0066627 -0.4976012 -0.944342 0.0578038 0.0348356 0.0303748 -0.0591751 -0.3088534 0.1137436 0.0007238 0.6594178 -0.2897652 -0.0228646 -0.0214835 -0.0002271 -0.1667729 -0.0534271 -0.2793568 0.0095827 0.2916489 0.3710493 -0.0320586 -0.012948 -0.0066384 -0.0919734 0.4989304 0.1081437 -0.0310922 -0.0346915 0.2378748 -0.0128156 -0.0249244 -0.0195303 -0.1054269 -0.2235876 -0.2039215 0.0094983 -0.3813336 -0.3415396 0.0229262 0.0166105 0.0151611 -0.1937454 1.4172575 0.3038062 -0.0664737 0.6331499 1.9771511 -0.0979125 -0.080921 -0.0840664 0.2528818 2.3193904 -0.2273016 -0.0974177 0.1330942 1.2473754 -0.0229796 -0.1131296 -0.0144839 0.3033772 0.1325353 -0.06558 0.0051645 -0.0420516 0.11264 0.0044009 0.0035261 0.0060648 0.1820443 0.0111797 -0.0394995 0.0080116 -0.0591001 0.0963416 0.0051617 0.0092401 0.0041649 0.156881 0.2919271 0.1067142 -0.0015448 0.2563654 0.3376664 -0.0120531 -0.0118191 -0.0067582 0.3151281 0.0976815 -0.0097051 0.0026288 0.0078351 -0.1089351 0.0102415 0.0020053 0.0110172 0.1470006 -0.0618387 0.0986139 0.0061506 0.0860609 0.0258144 0.0020905 0.0065123 0.0015068 0.1689281 0.1508988 -0.0245828 0.0051007 -0.1344564 0.2352174 0.0421906 -0.042343 0.0768536 0.4100421 0.342721 0.1715404 -0.003973 0.1161862 0.2162936 0.001935 -0.0021701 -0.0009385 0.4014578 0.480801 0.058894 -0.0143463 0.0144837 0.1685778 0.0133853 -0.0214204 0.0186042 0.3923998 unknown
polarizability: 187.5749806|-9.2734593|147.7632946|-5.577923|-3.9387061|46.005372 unknown
InChI: InChI=1S/C8H8N2O4/c11-7(12)5-3-1-2-4-6(5)9-8(13)10-14/h1-4,9-11,14H
charge 0 multiplicity 1
22 atoms
O  -2.849798 -2.286169 0.198222
O  -0.562008 -2.573564 0.103887
O  2.683886 1.242573 -0.199228
O  4.603294 -0.567363 -0.13097
N  0.958053 -0.418546 -0.04631
N  3.223176 -0.97955 -0.137092
C  -0.208673 0.363651 -0.028814
C  -1.485207 -0.307647 0.054635
C  -0.182058 1.786664 -0.089271
C  -2.683294 0.462052 0.07608
C  -1.384003 2.51424 -0.065698
C  -2.642389 1.862347 0.016944
C  -1.555677 -1.773673 0.117213
C  2.277405 0.029586 -0.122301
H  0.78496 2.288984 -0.154577
H  -3.636254 -0.069781 0.139943
H  0.763854 -1.441341 -0.0044
H  -1.340118 3.608172 -0.112788
H  -3.56896 2.444055 0.034071
H  3.12131 -1.972552 0.063408
H  -2.796717 -3.27871 0.234564
H  4.500218 0.437771 -0.199021
