program: Gaussian 09
title: 000260913
version: EM64L-G09RevD.01
frameworkgroup: C1[X(C6H9NO)]
method: RPBEPBE
basis: SDD
operation: Freq
keyword: #pfreq=noraman
keyword: PBEPBE/SDD
title: #p freq=noraman PBEPBE/SDD
converged: YES YES NO NO
title: Mulliken charges:
elementType: O N C C C C C C H H H H H H H H H
charge: -0.282516 -0.002689 0.373660 -0.120709 -0.451997 -0.689352 -0.682532 -0.227062 0.231110 0.233346 0.223723 0.236234 0.222526 0.251511 0.239992 0.216720 0.228035
chargesum: 0.00000
title: Mulliken charges with hydrogens summed into heavy atoms:
elementType: O N C C C C C C
charge: -0.282516 -0.002689 0.373660 0.110401 0.005071 0.020918 0.002217 -0.227062
polarizability: 7.27377875e+01 4.04588708e+00 7.78776613e+01 -2.34082493e+00 6.77582281e-01 5.72672307e+01
1716.lowfreq: -11.4955 -8.5045 -0.0012 -0.0012 -0.0009 9.9599 69.3688 129.6572 150.2541
frequency: 69.3192 129.6537 150.2476 168.3786 188.0466 214.9938 295.7584 342.1150 390.7076 458.3242 551.8031 586.1201 623.7631 726.0083 776.8516 826.0633 935.6842 954.8301 1005.2014 1065.0632 1076.3182 1120.6254 1134.8513 1209.4171 1233.8712 1314.6279 1318.4779 1387.8753 1398.9090 1404.4649 1460.1763 1470.2799 1472.9739 1478.7168 1486.3326 2186.6315 2987.0960 2991.2969 3006.1641 3058.1332 3072.9708 3082.8602 3086.8963 3090.2199 3107.3952
redmass: 2.5699 4.8985 2.3529 1.7251 1.3392 1.6292 2.3314 3.5534 4.0468 4.1141 10.4530 4.9404 4.0079 4.4798 1.3929 2.9031 1.5094 2.1373 1.3884 2.3904 1.5785 1.6452 2.3583 2.3732 1.4215 1.4475 1.4904 1.8362 1.2073 1.5184 1.0761 1.0563 1.0715 1.0415 1.0698 12.6224 1.0360 1.0366 1.0605 1.1016 1.0900 1.0983 1.1013 1.0996 1.0996
irintensity: 1.2443 1.9102 1.4454 2.2898 1.4472 2.1752 0.4011 2.1384 1.9138 12.1745 3.1093 1.5517 4.1674 4.3542 7.6241 21.3981 13.7320 16.3189 16.3015 11.1472 8.9844 3.6483 3.8105 5.2937 2.7093 4.1390 0.7931 5.1201 15.0265 26.2602 8.6390 14.2007 3.6424 14.9009 15.2119 5.8555 21.3922 13.0058 16.5529 0.6141 13.0531 18.8730 41.9114 31.3101 23.7903
temp: 298.150 k
press: 1.00000 atm
elementType: 8 7 6 6 6 6 6 6 1 1 1 1 1 1 1 1 1
symmnumber: 1
zpe: 359457.0 jmol-1
zpe.correction: 0.136910 hartree
zpe.thermalcorrener: 0.146053 hartree
zpe.thermalcorrenthalpy: 0.146997 hartree
zpe.thermalcorrgfe: 0.103129 hartree
zpe.sumelectzpe: -363.333022 hartree
zpe.sumelectthermal: -363.323879 hartree
zpe.sumelectthermalent: -363.322935 hartree
zpe.sumelectthermalfe: -363.366803 hartree
dipole: 0.7884 -3.5713 2.0855
dipole: 4.2101
quadrupole: -43.3596 -56.2443 -50.6148
quadrupole: -0.3108 -3.9198 -2.1890
quadrupole: 6.7133 -6.1714 -0.5419 -0.3108 -3.9198 -2.1890
hfenergy: -363.4699318 hartree
pointgroup: C01 [X(C6H9N1O1)]
dipole: -0.3287505 1.454636 0.7208046 debye
dipolederiv: -0.5238478 0.0253642 0.0586358 0.0294159 -0.373409 -0.0158359 0.0744157 0.0976914 -0.6159893 -0.202044 -0.010236 -0.0018068 -0.0480363 -0.280904 -0.0049977 0.018821 0.0129308 -0.2164801 0.4167377 -0.1141952 -0.020242 -0.1767253 0.2861973 0.0359335 -0.0823808 -0.0870232 0.3114125 0.4039577 0.0779053 0.0755274 -0.0097047 0.2885442 0.0179533 0.1618324 0.060292 0.3573283 0.0421121 -0.0322869 0.0559611 0.0041157 0.0273728 0.0184406 0.0138952 0.0407006 0.0702335 -0.1295391 0.0556464 -0.1219378 0.025807 -0.0269693 0.015241 -0.0813775 0.0112915 -0.0231703 -0.0205259 0.0116335 0.0444742 0.0410628 0.0601757 0.0114135 -0.0054631 0.0263293 0.0071556 -0.1374396 0.0642422 -0.0011063 0.1086111 0.1285915 0.0087703 -0.0296428 -0.046209 -0.0446208 0.0238623 0.0473689 -0.0125008 0.0750887 -0.1214589 -0.04198 -0.0450944 -0.024859 0.027459 -0.0127667 -0.0267091 -0.0522211 -0.0290617 0.0523362 -0.102721 -0.0600844 -0.0685517 -0.0580742 0.0364898 -0.0245327 0.0365568 -0.0087 -0.1089431 0.0719791 0.0316608 0.0409635 0.0616994 -0.081037 -0.0978752 0.0041822 -0.0958901 0.0463857 0.0462403 0.0425911 0.0401511 0.0872611 0.0712428 0.0095617 0.039052 0.025595 0.1058671 -0.0240815 -0.0020059 -0.039079 -0.1192082 0.1039921 0.0084389 -0.0158398 0.0515819 -0.0709007 -0.0208535 0.0009578 -0.0469292 0.0908909 0.1150172 -0.0076228 0.0088129 -0.0386752 -0.1086568 0.0747535 0.0159447 0.0428899 0.0569287 0.0445011 -0.079552 -0.0941481 -0.0539699 0.0279573 -0.0982889 -0.0432078 -0.0790238 -0.0683642 -0.1507129 0.0928488 -0.0033996 0.099485 0.0678139 0.0080334 -0.0108622 0.0184348 0.0755381 unknown
polarizability: 72.6316485|4.1303366|77.7933505|2.0655048|-2.0818689|57.4576805 unknown
InChI: InChI=1S/C6H9NO/c1-3-6(4-7)5(2)8-6/h5H,3H2,1-2H3
charge 0 multiplicity 1
17 atoms
O  0.910504 0.658814 -1.313274
N  -0.019416 -2.427277 0.203437
C  -0.126328 0.173938 -0.309038
C  1.019054 1.054839 0.144113
C  -1.53338 0.743607 -0.478539
C  2.225906 0.549047 0.89971
C  -2.373596 0.637207 0.814467
C  -0.052903 -1.256305 -0.028498
H  0.748535 2.108429 0.312257
H  -2.038751 0.213248 -1.307046
H  -1.427671 1.799342 -0.789377
H  3.122898 1.125833 0.612435
H  2.075738 0.667572 1.988816
H  2.415711 -0.516007 0.686194
H  -2.49024 -0.413929 1.133925
H  -1.907751 1.19708 1.645933
H  -3.383312 1.052261 0.649885
