program: Gaussian 09
title: 000252882
version: EM64L-G09RevD.01
frameworkgroup: C1[X(C15H12N2OS)]
method: RPBEPBE
basis: SDD
operation: Freq
keyword: #p
keyword: freq=noraman
keyword: PBEPBE/SDD
title: #p freq=noraman PBEPBE/SDD
converged: NO NO NO NO
title: Mulliken charges:
elementType: S O N N C C C C C C C C C C C C C C C H H H H H H H H H H H H
charge: 0.045725 -0.222266 -0.126958 -0.277921 0.356883 0.118193 0.125599 -0.336513 0.474321 -0.381862 -0.307237 -0.616892 -0.216842 -0.257419 -0.307424 -0.307594 -0.216096 -0.216190 -0.233710 0.224690 0.278437 0.272312 0.217501 0.272209 0.234625 0.240516 0.240980 0.240895 0.226891 0.226881 0.228266
chargesum: 0.00000
title: Mulliken charges with hydrogens summed into heavy atoms:
elementType: S O N N C C C C C C C C C C C C C C C
charge: 0.045725 -0.222266 -0.126958 -0.277921 0.356883 0.118193 0.125599 -0.336513 0.474321 -0.157172 -0.028800 0.145130 0.017783 -0.016903 -0.066444 -0.066699 0.010795 0.010691 -0.005443
polarizability: 2.88205635e+02 1.61898316e+01 1.94786535e+02 -2.00949618e-02 -7.86730341e-02 1.17510861e+02
1716.lowfreq: -107.2343 -8.2725 -5.4983 -0.0012 -0.0009 0.0003 10.8035 34.6738 43.3508
frequency: -107.2189 34.5909 43.1557 69.3949 77.7830 106.1208 137.7346 193.5338 216.9016 253.7913 276.5560 306.3421 334.2433 365.1096 396.0481 406.9665 408.5513 457.8238 469.8466 493.8506 526.9582 532.3046 603.2030 609.6657 624.9382 649.2054 663.1401 679.0502 695.0090 753.2397 763.6880 773.3835 786.1093 842.5676 852.1274 868.2966 889.0847 922.3298 970.9890 972.2513 989.5030 993.5824 1000.6261 1020.0275 1036.7525 1050.1011 1058.3582 1078.2462 1120.8506 1121.0795 1137.4931 1172.2565 1177.7378 1181.4604 1213.5173 1229.1226 1234.5737 1285.3265 1309.9673 1318.9298 1352.9057 1381.6849 1395.8277 1438.4142 1449.6739 1450.8168 1451.3848 1468.8996 1478.6542 1493.6410 1578.8394 1602.1636 1606.7044 1609.8803 1621.4450 3022.2326 3100.9020 3127.7980 3137.7552 3139.8126 3149.2513 3155.4179 3158.5115 3168.3333 3169.2633 3174.2158 3189.4659
redmass: 1.2779 5.6126 4.0072 5.7885 4.5485 3.2554 4.0520 4.7562 8.3996 4.6171 6.9494 4.8403 7.9610 11.8385 3.5149 3.8187 3.0781 4.5969 6.4569 3.8717 7.5597 3.9323 6.9108 6.7972 7.9604 5.4448 5.6606 4.1169 1.8924 1.8347 1.9873 2.3333 5.3546 1.2499 4.8118 1.5075 5.1291 1.5640 1.3680 1.3875 6.1603 1.3278 1.3387 2.5174 2.9531 2.5898 4.0995 1.5262 1.8382 1.3261 1.8305 1.0541 1.1738 1.2208 3.0219 3.0108 4.6248 2.0940 1.3142 4.2826 3.3037 9.8854 10.7585 2.2131 1.9884 1.1663 1.0399 2.1262 2.3732 1.4944 7.7421 6.7161 6.6134 7.7917 8.1255 1.0372 1.1014 1.0849 1.0885 1.0871 1.0929 1.0904 1.0974 1.0978 1.1017 1.0985 1.0929
irintensity: 0.0606 3.2685 0.3766 2.5462 0.0630 0.4286 2.1403 1.2765 4.0863 0.4016 3.0246 1.1470 9.5973 6.3709 2.9759 0.2972 0.1412 1.9358 9.1298 9.2177 2.6508 3.6741 13.4200 0.0153 4.1931 13.0970 5.6673 14.4267 40.2228 38.5966 69.9627 13.4349 0.5813 0.0369 12.1573 0.2404 4.8738 3.3275 1.2677 0.0334 3.1120 0.3859 0.3273 10.7082 10.6635 19.5954 6.2595 11.2722 29.0815 1.8613 45.7726 0.0003 5.5442 1.3565 118.3450 61.5527 26.4428 1.2405 0.0294 126.5457 426.7238 2.0559 10.1594 6.7086 98.3079 21.7613 16.4229 28.8718 15.9189 159.0024 5.7243 2.4091 18.0625 221.6648 166.5335 20.8590 8.1465 0.1642 4.8870 7.6675 29.8850 5.8853 22.7950 14.2983 10.9142 10.2825 25.3586
temp: 298.150 k
press: 1.00000 atm
elementType: 16 8 7 7 6 6 6 6 6 6 6 6 6 6 6 6 6 6 6 1 1 1 1 1 1 1 1 1 1 1 1
symmnumber: 1
zpe: 615055.7 jmol-1
zpe.correction: 0.234262 hartree
zpe.thermalcorrener: 0.249241 hartree
zpe.thermalcorrenthalpy: 0.250185 hartree
zpe.thermalcorrgfe: 0.191039 hartree
zpe.sumelectzpe: -1160.298173 hartree
zpe.sumelectthermal: -1160.283194 hartree
zpe.sumelectthermalent: -1160.282250 hartree
zpe.sumelectthermalfe: -1160.341396 hartree
dipole: -4.0580 0.9403 0.0028
dipole: 4.1655
quadrupole: -90.8880 -124.5585 -113.3075
quadrupole: -6.6936 -0.0128 -0.0439
quadrupole: 18.6967 -14.9738 -3.7229 -6.6936 -0.0128 -0.0439
hfenergy: -1160.5324351 hartree
pointgroup: C01 [X(C15H12N2O1S1)]
dipole: 1.6072936 0.3194788 0.0178445 debye
polarizability: 287.0947864|-19.1009239|195.8401878|0.6146366|1.9785601|117.5680562 unknown
InChI: InChI=1S/C15H12N2OS/c1-16-13-10-6-5-9-12(13)14(18)17(15(16)19)11-7-3-2-4-8-11/h2-10H,1H3
charge 0 multiplicity 1
31 atoms
S  -1.045525 2.810534 0.096601
O  -0.297333 -2.203876 -0.024535
N  1.39582 1.571728 0.081554
N  -0.520692 0.131217 0.032866
C  2.273209 0.455063 0.059062
C  1.71863 -0.859806 0.02223
C  0.258368 -1.071635 0.007691
C  -0.006162 1.444082 0.069172
C  -1.973559 -0.052237 0.018166
C  3.69323 0.582254 0.071599
C  2.558204 -2.00129 -0.001396
C  1.910674 2.961681 0.119209
C  4.512281 -0.561915 0.047812
C  3.955005 -1.865535 0.011029
C  -2.665896 -0.192213 1.237865
C  -2.647086 -0.138365 -1.216921
C  -4.061215 -0.407506 1.219917
C  -4.042404 -0.353794 -1.229747
C  -4.751438 -0.486543 -0.012601
H  4.180445 1.558232 0.099838
H  2.069351 -2.980298 -0.029406
H  1.54196 3.519433 -0.756776
H  3.005353 2.961634 0.123753
H  1.534305 3.474254 1.019212
H  5.600093 -0.431928 0.058125
H  4.603318 -2.746767 -0.007232
H  -2.11898 -0.127293 2.184365
H  -2.085873 -0.032838 -2.151301
H  -4.606522 -0.514288 2.164119
H  -4.573233 -0.419107 -2.185906
H  -5.834424 -0.653677 -0.024566
