program: Gaussian 09
title: 000252878
version: EM64L-G09RevD.01
frameworkgroup: C1[X(C15H13N3S)]
method: RPBEPBE
basis: SDD
operation: Freq
keyword: #p
keyword: freq=noraman
keyword: PBEPBE/SDD
title: #p freq=noraman PBEPBE/SDD
converged: NO YES NO NO
title: Mulliken charges:
elementType: S N N N C C C C C C C C C C C C C C C H H H H H H H H H H H H H
charge: 0.034384 -0.258197 -0.133663 -0.302336 0.344033 0.220869 -0.008933 -0.335365 0.490322 -0.386874 -0.290870 -0.617744 -0.226678 -0.287735 -0.304846 -0.304841 -0.216423 -0.216437 -0.237894 0.223182 0.209477 0.271462 0.214551 0.271408 0.235406 0.238205 0.237467 0.237446 0.228392 0.223643 0.223636 0.224954
chargesum: 0.00000
title: Mulliken charges with hydrogens summed into heavy atoms:
elementType: S N N N C C C C C C C C C C C C C C C
charge: 0.034384 -0.258197 -0.133663 -0.073945 0.344033 0.220869 -0.008933 -0.335365 0.490322 -0.163691 -0.081393 0.139676 0.008729 -0.049530 -0.067379 -0.067396 0.007220 0.007200 -0.012940
polarizability: 2.94337629e+02 1.31224875e+01 2.04273763e+02 -2.42616578e-02 -1.66200834e-02 1.19121667e+02
1716.lowfreq: -116.4826 -9.5969 -8.4578 -0.0005 0.0016 0.0017 8.0086 30.0048 44.9542
frequency: -116.4630 29.7196 44.9186 59.6120 69.9533 103.4674 121.8958 193.0515 219.0565 257.9243 286.7717 300.4458 355.4254 366.5138 401.2315 404.1637 408.2541 440.6909 476.0093 492.1745 524.3919 529.1814 602.4534 607.2986 615.6817 635.9027 657.6243 658.1329 693.1384 729.8981 751.3825 759.6765 777.4594 784.4198 834.8007 839.8836 853.9696 892.8669 917.6741 946.4277 969.4320 984.1336 989.1650 989.7146 1007.6295 1024.0888 1050.5494 1059.3162 1077.4781 1099.6820 1121.3490 1136.8742 1149.5030 1170.7622 1177.4150 1188.1428 1219.3100 1232.4825 1282.9937 1298.0373 1308.1847 1337.5679 1367.7432 1383.6137 1391.6792 1438.6317 1448.4694 1450.9654 1453.2738 1474.4310 1479.2127 1495.8941 1565.8584 1594.3216 1603.8153 1608.8165 1622.0048 3020.1299 3098.5673 3126.8839 3127.2174 3137.9851 3144.0729 3150.5233 3160.1295 3164.4304 3170.2294 3170.9706 3193.0639 3387.9383
redmass: 1.2898 5.2722 3.7123 5.0447 5.5749 3.0165 3.2887 4.7081 8.0947 4.6591 6.7374 4.7640 5.1991 10.6059 4.1162 3.4318 2.8193 4.0454 6.0872 3.6370 7.1682 3.9093 6.7333 7.3820 6.6193 4.0306 4.3195 6.0043 1.8597 1.9442 1.8887 1.3886 4.5213 1.7438 4.2379 1.2521 1.5495 4.6151 1.5584 1.3889 1.3886 1.3371 5.7457 1.3328 2.7562 1.9921 2.5669 4.7611 1.5159 1.7054 1.3094 2.5694 1.7200 1.0533 1.1139 1.1213 2.9233 3.3367 3.4668 2.0772 1.3150 5.0910 3.1084 9.9720 10.5159 2.2287 2.0223 1.0390 1.1661 2.0833 2.3479 1.5317 7.0101 7.3145 6.7796 6.2799 6.4937 1.0371 1.1015 1.0879 1.0847 1.0885 1.0891 1.0930 1.0972 1.0975 1.1015 1.0977 1.0925 1.0761
irintensity: 0.0775 1.6714 0.2119 0.5823 2.2414 1.6194 0.4101 0.6377 3.2603 0.1376 0.6707 1.7640 8.9819 3.6313 0.4331 8.1177 0.0189 0.1988 6.2747 1.5901 3.2344 5.7357 15.5638 0.4876 2.1223 29.2807 18.5513 3.7858 39.3278 2.5058 45.8338 93.5824 6.9902 38.0131 14.6197 0.0870 0.0269 4.3685 4.6358 0.8969 0.0004 0.0000 1.0056 1.1858 71.3084 1.7597 17.6253 3.9012 11.1676 134.4474 0.9864 34.7951 8.7240 0.0001 2.3017 1.5682 97.0045 44.6430 23.4128 14.6016 0.0242 238.3673 313.3868 1.7473 1.6714 6.5127 93.3787 15.6690 23.6325 49.0324 11.3763 153.9806 66.2823 94.1939 2.0468 24.9413 116.1829 24.2096 8.8291 5.2758 0.1960 7.0278 10.2239 35.9371 24.4669 19.7900 11.2714 14.7274 22.2771 20.3585
temp: 298.150 k
press: 1.00000 atm
elementType: 16 7 7 7 6 6 6 6 6 6 6 6 6 6 6 6 6 6 6 1 1 1 1 1 1 1 1 1 1 1 1 1
symmnumber: 1
zpe: 645673.8 jmol-1
zpe.correction: 0.245924 hartree
zpe.thermalcorrener: 0.261117 hartree
zpe.thermalcorrenthalpy: 0.262061 hartree
zpe.thermalcorrgfe: 0.202289 hartree
zpe.sumelectzpe: -1140.395901 hartree
zpe.sumelectthermal: -1140.380709 hartree
zpe.sumelectthermalent: -1140.379765 hartree
zpe.sumelectthermalfe: -1140.439536 hartree
dipole: -4.9409 -0.9364 0.0022
dipole: 5.0289
quadrupole: -96.3256 -118.1731 -115.5125
quadrupole: -3.9781 -0.0044 -0.0107
quadrupole: 13.6781 -8.1693 -5.5088 -3.9781 -0.0044 -0.0107
hfenergy: -1140.6418255 hartree
pointgroup: C01 [X(C15H13N3S1)]
dipole: 1.9320079 0.4262622 -0.0108036 debye
polarizability: 293.4664834|15.7897564|205.1337916|-1.1662182|0.4244896|119.1327848 unknown
InChI: InChI=1S/C15H13N3S/c1-17-13-10-6-5-9-12(13)14(16)18(15(17)19)11-7-3-2-4-8-11/h2-10,16H,1H3
charge 0 multiplicity 1
32 atoms
S  -1.060912 -2.780069 -0.045698
N  -0.516491 -0.106929 -0.034096
N  1.38522 -1.565671 -0.056459
N  -0.382942 2.226712 -0.022074
C  2.275802 -0.459583 -0.056257
C  1.740815 0.866037 -0.044678
C  0.270698 1.088569 -0.033043
C  -0.014576 -1.416429 -0.045335
C  -1.970746 0.073622 -0.021925
C  3.691975 -0.62153 -0.067265
C  2.624275 1.974212 -0.044358
C  1.881688 -2.962954 -0.067861
C  4.545977 0.495445 -0.066675
C  4.018267 1.808092 -0.055156
C  -2.665085 0.182864 -1.242675
C  -2.645514 0.1707 1.210752
C  -4.063077 0.375856 -1.228242
C  -4.043515 0.363685 1.220522
C  -4.755049 0.464484 0.00221
H  4.149568 -1.611613 -0.076395
H  2.20747 2.987915 -0.035504
H  1.507651 -3.49887 0.819633
H  2.976613 -2.979169 -0.074521
H  1.496909 -3.488286 -0.957097
H  5.629656 0.337233 -0.075229
H  4.682397 2.677374 -0.054679
H  -2.117084 0.111809 -2.187656
H  -2.082554 0.090635 2.146165
H  0.240683 3.054218 -0.021828
H  -4.610225 0.456373 -2.173891
H  -4.575552 0.434852 2.175501
H  -5.840644 0.613217 0.011615
