program: Gaussian 09
title: 000252876
version: EM64L-G09RevD.01
frameworkgroup: C1[X(C14H25Cl2NO2)]
method: RPBEPBE
basis: SDD
operation: Freq
keyword: #p
keyword: freq=noraman
keyword: PBEPBE/SDD
title: #p freq=noraman PBEPBE/SDD
converged: YES YES NO NO
title: Mulliken charges:
elementType: Cl Cl O O N C C C C C C C C C C C C C C H H H H H H H H H H H H H H H H H H H H H H H H H
charge: -0.049973 -0.051305 -0.288346 -0.295639 -0.073078 -0.360881 -0.356351 -0.355199 -0.365739 -0.354530 -0.323989 -0.696667 -0.372945 -0.389043 -0.062306 0.234523 -0.581683 -0.535335 -0.403325 0.187204 0.182224 0.199075 0.206410 0.188941 0.188504 0.211596 0.190622 0.193461 0.194529 0.216096 0.234240 0.209689 0.214272 0.209891 0.265216 0.257126 0.251222 0.241891 0.266098 0.262704 0.298248 0.283760 0.267687 0.261108
chargesum: 0.00000
title: Mulliken charges with hydrogens summed into heavy atoms:
elementType: Cl Cl O O N C C C C C C C C C C C C C C
charge: -0.049973 -0.051305 -0.288346 -0.295639 -0.073078 0.008546 0.049134 0.022246 0.036478 0.033459 0.126348 -0.062816 0.149396 0.104069 0.203791 0.234523 -0.020731 0.016111 -0.142216
polarizability: 2.31501078e+02 -2.52860001e+01 1.88391142e+02 -1.22708010e+01 -6.00678176e+00 1.68512140e+02
1716.lowfreq: -10.5827 -3.1479 -0.0025 -0.0017 -0.0008 1.8137 6.9352 11.3662 17.6708
frequency: 2.1260 10.7557 17.2575 27.5252 33.4278 46.5601 54.5679 62.9276 76.9344 90.6094 92.5860 104.8433 112.6922 126.9130 143.1746 168.8940 206.2718 217.8668 227.6572 230.0107 246.7371 257.0994 295.5230 310.7805 354.6993 361.1574 381.1369 425.5908 471.4525 486.7009 515.0586 556.7541 607.0911 669.8854 678.4467 691.6369 719.0876 730.4626 769.4944 782.0828 802.5762 828.5059 846.5604 861.1572 889.9564 904.3536 912.6072 954.1481 957.7984 974.8191 986.7055 1002.7207 1005.6073 1033.8669 1044.7225 1045.8630 1057.0381 1075.5499 1083.5237 1105.6455 1121.6664 1133.3754 1148.5512 1155.9286 1195.1414 1208.5511 1219.5622 1224.5346 1242.7098 1257.0372 1261.8485 1279.8411 1282.8992 1284.4804 1293.6022 1295.3643 1297.2612 1305.1538 1334.4611 1345.6490 1353.2919 1354.4830 1359.2015 1363.4347 1369.2880 1387.8561 1413.3506 1437.0713 1446.8745 1454.2229 1458.6554 1461.0409 1461.6001 1463.2781 1471.4882 1476.9138 1479.9145 1486.7820 1491.2972 1600.7914 1651.7799 2948.3423 2954.7370 2965.5992 2966.5027 2970.9847 2976.4157 2980.0512 2985.9371 3001.6610 3009.1414 3018.8642 3026.4147 3029.8319 3049.2720 3052.8052 3063.1674 3066.7098 3067.7193 3069.6618 3083.8859 3096.3757 3114.3924 3141.0259 3149.1011 3174.9155
redmass: 2.5650 5.8401 2.6958 7.0699 7.5070 6.0088 4.7907 7.2641 4.0203 2.6871 2.8985 2.1847 2.4979 2.6672 3.2657 3.6999 4.5765 3.3233 3.9192 1.1640 3.3615 3.3605 3.3755 3.2481 3.7029 2.8175 3.1764 2.6236 3.2182 2.7225 2.5584 3.5358 5.0934 5.0682 5.8701 5.8873 1.0771 1.1545 1.5463 1.1968 2.0871 1.7642 1.8594 1.9811 1.7992 2.0113 1.5903 2.7716 2.3883 1.2172 1.5411 3.6094 1.6320 1.7059 2.7620 3.0338 2.5630 2.3453 2.0110 2.3873 2.4136 1.7197 2.0379 1.2313 1.5885 1.7860 1.2724 1.3300 1.3045 1.2482 1.1623 1.1310 1.2923 1.0984 1.1660 1.3021 1.1770 1.2785 1.4144 1.3495 1.4079 1.5404 1.3572 1.5693 1.4917 1.2181 2.3154 1.0975 1.0829 1.0901 1.0973 1.0983 1.0876 1.0766 1.0766 1.0426 1.0807 1.0856 1.1151 9.9747 5.5094 1.0589 1.0588 1.0604 1.0589 1.0367 1.0608 1.0653 1.0969 1.0998 1.0694 1.0890 1.0630 1.1025 1.1034 1.0613 1.0566 1.0933 1.1008 1.0993 1.1082 1.1022 1.0913 1.1109 1.1114 1.0921
irintensity: 0.0344 0.4259 0.2307 0.4373 1.0718 1.7363 1.3058 2.6613 0.8430 0.2861 0.8875 3.6209 1.0408 1.1842 1.4239 5.0835 2.3060 0.6420 4.0002 0.2123 2.3979 0.2657 4.8490 12.3987 14.4144 1.4861 0.6513 1.1611 4.0332 5.4012 8.6970 5.8993 15.1917 2.4479 12.6541 58.2989 14.5933 0.5436 5.4142 5.7698 10.2682 42.3729 3.7391 4.0412 1.5576 25.2808 1.8064 67.1267 9.4082 31.6416 80.2073 16.0745 9.6633 7.1633 26.4440 44.0965 5.6789 25.1189 22.6159 550.3652 21.5945 20.6234 3.2700 13.0635 0.7749 32.1046 13.7547 80.8700 0.7892 4.0591 11.2666 0.7587 8.8534 0.6527 1.0294 26.9356 6.9453 7.4462 0.0943 61.4001 3.3249 3.7528 85.8811 1.2457 24.8837 11.1092 32.7880 8.3043 3.2411 10.7705 17.7141 13.2357 11.0468 0.9703 2.6399 12.1855 4.4447 21.9417 11.6906 425.6001 530.4599 6.6960 9.3689 22.1431 61.8765 32.2531 91.2940 32.7330 3.0700 2.6691 39.2148 27.3596 7.6445 13.7179 113.9392 15.2173 17.3164 11.2444 100.4139 57.1288 23.4649 2.0652 2.8880 15.6333 10.8383 11.7571
temp: 298.150 k
press: 1.00000 atm
elementType: 17 17 8 8 7 6 6 6 6 6 6 6 6 6 6 6 6 6 6 1 1 1 1 1 1 1 1 1 1 1 1 1 1 1 1 1 1 1 1 1 1 1 1 1
symmnumber: 1
zpe: 975147.6 jmol-1
zpe.correction: 0.371414 hartree
zpe.thermalcorrener: 0.395222 hartree
zpe.thermalcorrenthalpy: 0.396166 hartree
zpe.thermalcorrgfe: 0.309117 hartree
zpe.sumelectzpe: -1672.269918 hartree
zpe.sumelectthermal: -1672.246111 hartree
zpe.sumelectthermalent: -1672.245166 hartree
zpe.sumelectthermalfe: -1672.332215 hartree
dipole: -1.5747 1.3085 -2.2766
dipole: 3.0619
quadrupole: -123.2461 -134.1386 -135.0784
quadrupole: -9.3854 17.8284 -5.4907
quadrupole: 7.5749 -3.3176 -4.2574 -9.3854 17.8284 -5.4907
hfenergy: -1672.6413326 hartree
pointgroup: C01 [X(C14H25Cl2N1O2)]
dipole: -0.773528 -0.3382963 -0.8592716 debye
polarizability: 228.3548744|-31.5567917|175.5344994|6.4587707|-5.157592|184.5149871 unknown
InChI: InChI=1S/C14H25Cl2NO2/c1-2-3-4-5-6-13-19-14(18)7-10-17(11-8-15)12-9-16/h7,10H,2-6,8-9,11-13H2,1H3
charge 0 multiplicity 1
44 atoms
Cl -4.827804 1.378425 3.528288
Cl -3.630572 3.011798 -1.984356
O  0.755217 -1.507555 1.888047
O  0.173828 -2.268699 -0.261453
N  -3.262217 0.255072 -0.140322
C  4.698329 -0.005089 0.294141
C  3.387225 -0.815334 0.402707
C  4.867124 0.699784 -1.070584
C  3.234789 -1.52526 1.765663
C  6.178522 1.510725 -1.182665
C  1.964358 -2.378851 1.883874
C  6.342596 2.20642 -2.551312
C  -3.648324 1.1059 1.004066
C  -4.074698 0.28243 -1.370413
C  -2.122829 -0.524371 -0.101958
C  -0.068679 -1.540016 0.742555
C  -4.395257 0.272233 2.061993
C  -3.523678 1.190933 -2.47833
C  -1.204316 -0.634316 0.919514
H  4.730667 0.753162 1.104847
H  5.563755 -0.679947 0.465846
H  3.344706 -1.56798 -0.410525
H  2.523882 -0.139234 0.243923
H  4.003379 1.375108 -1.244797
H  4.835572 -0.058107 -1.881231
H  3.246613 -0.777932 2.583716
H  4.1033 -2.196426 1.935046
H  7.040178 0.835064 -1.004235
H  6.207102 2.269828 -0.374255
H  1.928451 -2.913565 2.849004
H  1.877794 -3.095724 1.047164
H  6.346585 1.465741 -3.373437
H  7.287535 2.777997 -2.606522
H  5.509993 2.9104 -2.740076
H  -4.28656 1.929484 0.645651
H  -2.748074 1.56433 1.451018
H  -5.104871 0.589843 -1.118753
H  -4.134361 -0.743115 -1.78925
H  -1.940273 -1.136214 -0.996113
H  -5.353193 -0.118439 1.687308
H  -3.776233 -0.541042 2.466269
H  -2.458631 1.002494 -2.679367
H  -4.117913 1.10215 -3.401213
H  -1.267318 -0.08581 1.862123
