program: Gaussian 09
title: 000252869
version: EM64L-G09RevD.01
frameworkgroup: C1[X(C24H20Cl3N3)]
method: RPBEPBE
basis: SDD
operation: Freq
keyword: #p
keyword: freq=noraman
keyword: PBEPBE/SDD
title: #p freq=noraman PBEPBE/SDD
converged: NO NO NO NO
title: Mulliken charges:
elementType: Cl Cl Cl N N N C C C C C C C C C C C C C C C C C C C C C C C C H H H H H H H H H H H H H H H H H H H H
charge: -0.045936 -0.044309 -0.047648 -0.170387 -0.009370 -0.095615 0.231231 0.232448 0.258198 0.261806 -0.389621 0.485320 -0.401907 -0.409445 -0.387601 -0.393731 -0.435230 -0.395292 -0.232347 -0.229361 -0.233142 -0.253270 -0.337433 -0.373278 -0.585280 -0.584950 0.555156 -0.372450 -0.400264 -0.358258 0.252495 0.252103 0.253526 0.254269 0.246523 0.248667 0.279698 0.283484 0.227404 0.228259 0.230479 0.229740 0.262461 0.239119 0.294182 0.270550 0.295055 0.269912 0.275694 0.268348
chargesum: 0.00000
title: Mulliken charges with hydrogens summed into heavy atoms:
elementType: Cl Cl Cl N N N C C C C C C C C C C C C C C C C C C C C C C C C
charge: -0.045936 -0.044309 -0.047648 -0.170387 -0.009370 -0.095615 0.231231 0.232448 0.258198 0.261806 -0.389621 0.485320 -0.155384 -0.160778 0.116997 0.114064 -0.155532 -0.111808 -0.004943 -0.001102 -0.002663 -0.023530 -0.074972 -0.134159 -0.020549 -0.019983 0.555156 -0.372450 -0.124570 -0.089910
polarizability: 7.12445354e+02 -8.33237952e-01 3.19973478e+02 -1.37159569e+01 5.67722424e+01 2.13290463e+02
1716.lowfreq: -5.8463 -0.7176 -0.0012 0.0010 0.0012 4.0036 5.0994 16.3687 19.7189
frequency: -2.6337 16.2558 19.7102 27.3112 32.5723 39.6104 45.6717 78.7614 89.6321 103.0261 106.9398 117.1470 130.3797 135.1663 156.1597 173.2199 184.1408 188.2527 207.9219 214.7387 230.6781 242.2804 255.9064 276.9388 315.5300 345.4937 369.0133 386.4564 402.5479 407.3686 415.0428 432.9738 435.2343 456.6493 483.1886 499.5880 509.8640 540.2809 551.1443 571.2543 597.4612 607.8575 615.6101 653.4295 662.5705 666.6623 686.1242 707.0792 713.0686 728.1064 749.6190 758.7561 762.0232 784.1949 786.5466 794.4482 804.1705 813.2401 823.5951 841.3722 858.3107 891.6539 901.2706 923.3708 949.7529 958.2568 959.3394 961.8137 973.3311 984.4982 990.3988 992.6804 993.2317 1000.0435 1017.7438 1021.3207 1033.2315 1036.0852 1038.3240 1045.8210 1085.1911 1102.3346 1119.0052 1153.5144 1164.8767 1169.0349 1174.2788 1188.4504 1218.4607 1219.2159 1235.3598 1244.3441 1259.6958 1260.5065 1279.2053 1290.8249 1292.8919 1297.4391 1301.4951 1333.0592 1352.4715 1355.3753 1365.6987 1378.2988 1392.9679 1403.7339 1436.5769 1437.8015 1444.3948 1462.3549 1462.7632 1463.1866 1475.3849 1488.1073 1499.0622 1511.5278 1518.2780 1539.3292 1585.9727 1590.7951 1597.8227 1615.1030 1619.8617 1623.7428 3018.0975 3022.2442 3061.3915 3062.6711 3073.2223 3074.4378 3079.0689 3125.5468 3126.7850 3138.5980 3140.6698 3143.6803 3145.0707 3145.9809 3153.2865 3156.2068 3167.2759 3168.1782 3173.6857 3177.4659
redmass: 7.1456 9.0175 9.2063 11.1157 16.5818 8.6701 7.7259 4.4693 4.8693 3.4557 3.4436 3.6760 4.9874 3.8434 3.4461 8.2217 5.8408 6.0750 6.4584 4.5247 6.2422 3.9067 5.6435 4.7779 4.8867 4.7204 5.5450 5.9458 5.1953 3.6767 5.8274 4.2508 4.0546 3.3544 4.2071 4.6484 5.4400 4.9183 5.0788 3.3109 4.3145 5.6431 7.0387 4.0936 6.9780 6.8517 6.3003 5.2159 4.9880 3.6911 1.4909 4.9235 1.4858 2.0472 1.2351 1.5420 2.4611 2.6188 1.4091 1.6281 4.8105 1.4557 1.7077 4.7943 3.0961 1.7402 2.0737 1.4443 2.0011 1.6203 1.3615 1.3498 6.1098 1.4498 2.2636 3.0315 1.8300 3.4375 2.8847 1.8865 2.4146 1.6514 1.5286 1.5118 1.5076 1.0893 1.4609 1.5917 2.1235 2.3086 2.1784 1.4506 1.1776 1.1654 1.4034 1.3803 1.2655 1.7848 1.7177 2.0628 1.3803 1.3839 2.7567 8.1255 2.0003 2.8805 3.8904 2.4057 3.0327 1.1329 2.5805 1.0973 4.1374 1.0959 2.5594 1.5972 3.2489 7.2889 7.7905 6.9128 6.9806 7.5855 7.4294 7.1349 1.0604 1.0614 1.0568 1.0571 1.1041 1.0893 1.1035 1.0857 1.0857 1.0905 1.0910 1.1115 1.1037 1.0958 1.0947 1.0961 1.0996 1.0951 1.0974 1.0914
irintensity: 0.1448 0.0447 0.0058 0.3570 0.3960 1.3132 1.9787 0.6253 0.1643 0.2579 3.2560 1.7300 0.1918 0.3831 6.6397 1.6018 7.9432 1.2341 4.0500 0.6922 0.5577 12.1733 1.1982 0.1351 6.1742 2.0936 8.1150 0.8206 11.9883 1.9833 0.1472 5.5389 10.2009 6.5229 3.1708 5.1586 0.9435 6.5583 13.5166 0.5409 7.0506 0.8473 1.8087 14.1752 8.1012 40.6687 80.4904 70.2000 11.3435 5.6861 135.1539 9.2143 0.7033 23.5960 0.3299 25.0258 2.2922 32.2223 20.9387 35.0962 12.5540 1.4755 0.7450 4.8389 39.2507 38.7018 32.8389 4.0891 13.9152 18.8693 0.4449 0.9722 3.0594 2.8411 3.8304 44.2983 2.5623 0.6042 0.1957 1.3416 1.1641 5.1654 47.2868 10.6017 2.1571 0.4280 2.4910 137.7978 25.4435 3.9754 0.8761 27.8645 38.0835 17.9511 128.3998 37.4645 15.1370 4.7144 19.4515 10.4245 82.7265 94.4291 1.9307 9.0942 77.6370 4.3802 33.3510 42.4524 66.2227 9.6967 1.1293 15.4758 103.2769 27.2886 257.8541 140.6793 20.0638 65.7940 46.4712 9.9757 1.6914 15.4286 163.2548 563.5916 20.9378 28.3851 13.0124 18.4044 5.6151 8.6822 9.3440 3.0240 0.5956 9.6426 8.7907 8.6035 19.7021 1.4786 25.9624 43.5022 41.0969 14.0390 11.9976 12.3453
temp: 298.150 k
press: 1.00000 atm
elementType: 17 17 17 7 7 7 6 6 6 6 6 6 6 6 6 6 6 6 6 6 6 6 6 6 6 6 6 6 6 6 1 1 1 1 1 1 1 1 1 1 1 1 1 1 1 1 1 1 1 1
symmnumber: 1
zpe: 996751.4 jmol-1
zpe.correction: 0.379643 hartree
zpe.thermalcorrener: 0.405970 hartree
zpe.thermalcorrenthalpy: 0.406914 hartree
zpe.thermalcorrgfe: 0.319393 hartree
zpe.sumelectzpe: -2468.867964 hartree
zpe.sumelectthermal: -2468.841637 hartree
zpe.sumelectthermalent: -2468.840693 hartree
zpe.sumelectthermalfe: -2468.928214 hartree
dipole: -1.4169 1.7701 1.1716
dipole: 2.5521
quadrupole: -176.6735 -205.5809 -196.2082
quadrupole: -0.5229 5.9134 13.7898
quadrupole: 16.1473 -12.7600 -3.3873 -0.5229 5.9134 13.7898
hfenergy: -2469.247607 hartree
pointgroup: C01 [X(C24H20Cl3N3)]
dipole: -0.5685617 -0.7867699 -0.2567541 debye
polarizability: 712.2697105|-1.6708481|341.8323907|17.1496465|19.9173894|191.6071941 unknown
InChI: InChI=1S/C24H20Cl3N3/c25-11-13-30(14-12-26)18-10-9-17(23(27)15-18)16-28-29-24-21-7-3-1-5-19(21)20-6-2-4-8-22(20)24/h1-10,15-16H,11-14H2
charge 0 multiplicity 1
50 atoms
Cl -6.64086 -3.309069 2.601432
Cl -8.118989 1.887541 -2.358047
Cl -2.038605 3.563722 -0.920278
N  -5.520159 -0.167795 0.136861
N  2.247094 1.07333 0.678356
N  0.956193 0.580454 0.562537
C  5.514681 -0.321474 -0.028187
C  4.656525 -1.37912 -0.609289
C  4.664502 0.69586 0.509744
C  3.282535 -1.001551 -0.430442
C  3.250204 0.305062 0.280543
C  -4.169821 0.222331 0.140225
C  6.91319 -0.198526 0.062666
C  4.983678 -2.588016 -1.247993
C  -5.937634 -1.51329 0.577409
C  -6.587349 0.746932 -0.314284
C  5.199327 1.834564 1.136617
C  2.24154 -1.831784 -0.889888
C  7.455476 0.949955 0.695778
C  3.932835 -3.425177 -1.70594
C  6.60908 1.954627 1.227876
C  2.578453 -3.054104 -1.526795
C  -3.774928 1.514666 -0.322818
C  -3.137543 -0.657258 0.607396
C  -6.103166 -1.570758 2.107625
C  -6.741638 0.707016 -1.846654
C  -1.381795 1.032182 0.145462
C  -2.423049 1.885565 -0.308162
C  -1.79875 -0.257357 0.599062
C  0.023056 1.429042 0.160965
H  -6.900351 -1.762102 0.098194
H  -5.215559 -2.280819 0.247131
H  -7.539936 0.444317 0.154112
H  -6.390672 1.781052 0.020164
H  7.57826 -0.96935 -0.342384
H  6.027573 -2.887403 -1.392205
H  4.536258 2.605476 1.541111
H  1.197486 -1.536599 -0.75686
H  8.542712 1.061739 0.774524
H  4.173361 -4.369702 -2.207024
H  7.049457 2.833292 1.711941
H  1.783033 -3.714305 -1.889521
H  -4.506275 2.235254 -0.694532
H  -3.382966 -1.656209 0.977855
H  -5.16161 -1.378176 2.641905
H  -6.891468 -0.89313 2.468109
H  -5.836439 1.04699 -2.3702
H  -7.042205 -0.286859 -2.21076
H  -1.016535 -0.932803 0.961504
H  0.283892 2.43917 -0.18984
