program: Gaussian 09
title: 000260897
version: EM64L-G09RevD.01
frameworkgroup: C1[X(C10H14N2O3)]
method: RPBEPBE
basis: SDD
operation: Freq
keyword: #p
keyword: freq=noraman
keyword: PBEPBE/SDD
title: #p freq=noraman PBEPBE/SDD
converged: NO YES NO NO
title: Mulliken charges:
elementType: O O O N N C C C C C C C C C C H H H H H H H H H H H H H H
charge: -0.295008 -0.260649 -0.254541 -0.235770 -0.047023 0.046876 -0.408283 -0.418191 -0.375507 -0.305228 -0.084406 0.043926 -0.338472 0.166382 -0.506544 0.254543 0.207849 0.260336 0.228516 0.208325 0.205887 0.212272 0.191473 0.224917 0.297615 0.260300 0.246088 0.228121 0.246195
chargesum: 0.00000
title: Mulliken charges with hydrogens summed into heavy atoms:
elementType: O O O N N C C C C C C C C C C
charge: -0.295008 -0.260649 -0.254541 -0.235770 -0.047023 0.301419 0.059901 0.018650 0.042653 0.111162 0.213209 0.043926 -0.078172 0.166382 0.213861
polarizability: 1.91512152e+02 5.16596407e+00 1.24129191e+02 -5.07120888e+00 -6.95360417e+00 8.45299869e+01
1716.lowfreq: -6.5893 -0.0002 0.0007 0.0008 3.3921 10.9978 39.3216 51.0268 90.2091
frequency: 39.3163 50.9941 90.1797 117.2188 128.2305 166.9608 188.0961 221.1731 229.8793 236.4427 252.8253 337.2704 367.2565 431.6027 438.6639 453.7488 484.5047 504.3863 530.3752 567.7951 633.3112 685.0186 710.8112 748.8723 782.1653 788.7215 810.9588 831.2550 863.7872 895.0351 920.2429 931.3999 957.5900 969.0630 985.6622 1021.2217 1039.1523 1061.0176 1093.6497 1112.4352 1117.9619 1129.2122 1161.9861 1168.6876 1180.1080 1191.8210 1244.4212 1250.5474 1269.3708 1284.3109 1309.1795 1327.3821 1337.3853 1346.6679 1361.2666 1372.4615 1404.6918 1445.9265 1450.9402 1454.9900 1459.2627 1461.8581 1463.1571 1474.3904 1509.6163 1593.6437 1632.3287 2953.3785 2981.0067 2982.2525 2990.7536 3000.4495 3008.1742 3048.2462 3057.8906 3075.8004 3085.4840 3112.6807 3147.6280 3190.9911 3218.5990
redmass: 3.7917 4.6647 3.5166 1.6676 1.7757 4.5143 3.6120 3.9880 2.9024 4.0728 4.6553 2.0542 5.4654 3.7548 4.0989 3.5557 3.6188 4.6950 2.3656 5.8541 5.5657 4.0017 7.4578 9.2275 1.7710 2.0537 3.4548 1.6153 2.5647 2.6383 6.5674 1.9526 1.4054 3.8003 2.2226 2.9828 2.0983 2.2080 2.2082 1.2588 2.3233 2.2583 1.3503 2.0617 2.1584 1.4752 1.3549 1.2590 2.3661 1.7740 1.2409 1.4739 1.4291 1.4366 1.2692 1.4639 1.6150 1.0511 1.1001 1.5759 1.1711 1.0911 1.0896 1.0914 7.5151 7.4176 9.2063 1.0684 1.0774 1.0688 1.0612 1.0642 1.0287 1.0983 1.1007 1.1021 1.0976 1.1044 1.1057 1.0910 1.0991
irintensity: 0.0374 6.3180 2.3315 3.3707 1.5318 6.9416 4.3386 9.9953 6.0984 0.9959 8.2948 0.7550 0.1682 1.1341 0.5273 0.2249 5.6714 9.5404 5.5894 4.3359 11.1371 3.3303 2.3843 12.1138 58.2155 7.4413 3.5778 8.2403 4.1377 26.3738 3.6421 6.4411 13.1727 100.8592 1.5380 133.9201 22.1628 16.6611 23.1540 0.1785 17.9867 8.7560 14.6473 20.7700 41.7683 55.7999 43.6020 15.9182 163.4001 124.4650 13.2859 46.9642 11.6454 10.2935 2.8971 41.3453 52.4285 14.0280 5.0196 110.5558 40.2524 5.8710 10.1544 11.6861 103.9436 176.1553 606.1101 61.3047 4.5245 27.3021 33.5961 24.8655 40.9991 35.4961 54.7100 16.9841 34.8584 23.2404 24.2931 3.3524 0.2084
temp: 298.150 k
press: 1.00000 atm
elementType: 8 8 8 7 7 6 6 6 6 6 6 6 6 6 6 1 1 1 1 1 1 1 1 1 1 1 1 1 1
symmnumber: 1
zpe: 615689.2 jmol-1
zpe.correction: 0.234504 hartree
zpe.thermalcorrener: 0.248305 hartree
zpe.thermalcorrenthalpy: 0.249249 hartree
zpe.thermalcorrgfe: 0.193532 hartree
zpe.sumelectzpe: -723.485942 hartree
zpe.sumelectthermal: -723.472140 hartree
zpe.sumelectthermalent: -723.471196 hartree
zpe.sumelectthermalfe: -723.526913 hartree
dipole: 2.8764 -2.7258 1.3513
dipole: 4.1868
quadrupole: -66.6794 -96.5369 -88.4788
quadrupole: 0.5073 -0.7424 1.9500
quadrupole: 17.2189 -12.6385 -4.5804 0.5073 -0.7424 1.9500
hfenergy: -723.7204451 hartree
pointgroup: C01 [X(C10H14N2O3)]
dipole: 1.1301663 1.1286017 -0.4028844 debye
polarizability: 191.5205955|-5.5950308|125.1756605|4.5863428|-2.2296702|83.4750744 unknown
InChI: InChI=1S/C10H14N2O3/c1-14-8-5-6-12(10(13)11-8)9-4-2-3-7-15-9/h5-6,9H,2-4,7H2,1H3
charge 0 multiplicity 1
29 atoms
O  2.124588 1.025795 0.722407
O  -0.371706 -2.208036 0.362603
O  -3.984174 0.746182 -0.226118
N  0.04359 0.088496 0.127021
N  -2.218927 -0.768288 0.090974
C  1.491035 -0.209639 0.250978
C  2.109134 -0.678886 -1.081943
C  3.629416 -0.898767 -0.895921
C  4.294179 0.376204 -0.325795
C  3.572298 0.822431 0.959297
C  -0.413247 1.372991 -0.078639
C  -0.86023 -1.053385 0.204604
C  -1.767053 1.626506 -0.213439
C  -2.634407 0.48563 -0.110316
C  -4.897023 -0.416518 -0.111512
H  1.58807 -1.014621 1.009001
H  1.923903 0.095999 -1.850959
H  1.607271 -1.610554 -1.396011
H  4.091682 -1.181161 -1.858891
H  3.7946 -1.747135 -0.200769
H  5.362792 0.197051 -0.098862
H  4.243132 1.192183 -1.072153
H  3.701716 0.063478 1.76164
H  3.932035 1.797253 1.326392
H  0.351699 2.151156 -0.10059
H  -2.15993 2.630264 -0.369322
H  -4.672321 -1.157915 -0.89575
H  -5.900618 0.014423 -0.237063
H  -4.782402 -0.897035 0.873935
