program: Gaussian 09
title: 000260902
version: EM64L-G09RevD.01
frameworkgroup: C1[X(C7H14O7S)]
method: RPBEPBE
basis: SDD
operation: Freq
keyword: #p
keyword: freq=noraman
keyword: PBEPBE/SDD
title: #p freq=noraman PBEPBE/SDD
converged: NO YES NO NO
title: Mulliken charges:
elementType: S O O O O O O O C C C C C C C H H H H H H H H H H H H H H
charge: 1.042664 -0.275251 -0.424201 -0.446444 -0.439730 -0.267963 -0.512254 -0.498226 -0.240440 -0.107061 -0.122140 -0.043167 -0.346527 -0.721495 -0.506203 0.286839 0.308738 0.280067 0.244606 0.245166 0.258062 0.371065 0.354379 0.285572 0.290767 0.294968 0.235345 0.214555 0.238309
chargesum: 0.00000
title: Mulliken charges with hydrogens summed into heavy atoms:
elementType: S O O O O O O O C C C C C C C
charge: 1.042664 -0.275251 -0.424201 -0.075379 -0.085351 -0.267963 -0.512254 -0.498226 0.046399 0.201677 0.157927 0.201439 0.156701 0.149812 0.182007
polarizability: 1.54684710e+02 -6.47005137e+00 1.23747340e+02 -3.01066540e+00 2.84574387e+00 1.07543550e+02
1716.lowfreq: -12.6411 -8.1645 -6.3436 -0.0015 -0.0014 0.0010 17.8120 23.8821 41.8155
frequency: 17.6301 23.5047 41.7555 60.5891 104.3724 116.5579 137.7167 151.4751 164.2151 182.2158 192.3476 218.8072 236.9219 260.9419 266.1009 294.0140 334.3008 340.0550 368.4077 380.3465 431.0089 452.0789 490.9927 502.7633 546.6371 588.5650 599.2939 634.5706 662.5575 718.4697 823.8291 837.6345 840.0063 868.3506 896.4495 913.1903 919.4913 961.3651 976.9135 994.6821 1009.3192 1039.1158 1050.3928 1060.2340 1087.0935 1113.1533 1120.9781 1152.1103 1199.5611 1217.4530 1237.7052 1251.0753 1282.0147 1291.7430 1304.2923 1316.5699 1332.8636 1345.3176 1360.4126 1374.9773 1377.4079 1415.5551 1416.9776 1429.8090 1456.8730 1461.3095 1475.7827 2965.2309 3009.2613 3010.3205 3026.1387 3040.7065 3061.5756 3080.1021 3097.6230 3116.7167 3125.9897 3189.6341 3198.9541 3436.0281 3481.0506
redmass: 5.1691 6.8067 5.5395 5.0984 2.2869 5.5756 1.3255 1.0809 4.0386 4.4973 3.8705 4.7331 3.5307 4.4242 5.6674 6.9528 9.8283 7.9756 7.0724 5.6497 6.4514 4.2491 1.2572 2.9609 8.2942 5.1206 7.9990 2.4610 1.3856 3.7292 4.0496 6.4987 6.0676 3.0313 5.6714 2.8598 5.2255 4.7109 3.4212 1.4183 3.8492 1.9773 2.8481 3.1301 2.8528 1.2670 2.1133 1.5036 1.3425 1.2472 1.3551 1.3134 1.3701 1.2289 1.1960 1.1323 1.3399 1.3799 1.2806 1.2103 1.2120 1.0516 1.0509 1.1486 1.0517 1.0830 1.0522 1.0335 1.0862 1.0860 1.0617 1.0247 1.1014 1.0857 1.0875 1.1048 1.1015 1.1080 1.1079 1.0649 1.0649
irintensity: 1.2789 5.3577 1.2262 6.3268 1.2685 5.2593 0.7978 0.1988 0.7808 1.8545 2.2114 4.3813 29.3282 4.2701 11.5778 12.8408 16.1475 25.3760 43.7095 0.2798 26.7594 17.7244 47.6384 58.4513 21.5597 10.5393 79.4882 32.5577 125.1629 32.6780 11.7682 114.7973 36.9410 39.9060 33.3771 29.2675 117.5083 81.7611 72.5975 41.2867 118.3415 58.3445 18.1689 104.2220 5.6298 0.7457 4.6330 12.9919 84.2563 4.6961 20.3094 24.4342 8.1103 3.9354 15.2502 3.3069 13.1982 23.5062 17.1158 24.8039 42.6219 14.0701 13.2479 6.4223 14.1895 5.7511 12.3525 61.1088 16.3877 22.1378 12.7173 0.3646 38.3876 7.9591 12.3270 6.8725 18.8903 0.1231 0.0639 42.1677 16.9899
temp: 298.150 k
press: 1.00000 atm
elementType: 16 8 8 8 8 8 8 8 6 6 6 6 6 6 6 1 1 1 1 1 1 1 1 1 1 1 1 1 1
symmnumber: 1
zpe: 577620.2 jmol-1
zpe.correction: 0.220004 hartree
zpe.thermalcorrener: 0.237479 hartree
zpe.thermalcorrenthalpy: 0.238423 hartree
zpe.thermalcorrgfe: 0.172841 hartree
zpe.sumelectzpe: -1198.328583 hartree
zpe.sumelectthermal: -1198.311108 hartree
zpe.sumelectthermalent: -1198.310164 hartree
zpe.sumelectthermalfe: -1198.375745 hartree
dipole: -0.7141 0.7793 1.5741
dipole: 1.8961
quadrupole: -87.2167 -102.2187 -99.8136
quadrupole: 10.5725 -20.9743 -0.7769
quadrupole: 9.1996 -5.8024 -3.3973 10.5725 -20.9743 -0.7769
hfenergy: -1198.5485866 hartree
pointgroup: C01 [X(C7H14O7S1)]
dipole: -0.2142343 -0.2482356 -0.6700435 debye
polarizability: 152.0225313|9.7537031|124.7651944|5.5043297|6.0977966|109.1878743 unknown
InChI: InChI=1S/C7H14O7S/c1-12-7-6(9)5(8)4(3-13-7)14-15(2,10)11/h4-9H,3H2,1-2H3
charge 0 multiplicity 1
29 atoms
S  -3.039109 -0.770223 -0.279928
O  1.598044 -0.48529 1.26474
O  -1.423929 0.135504 -0.662851
O  0.864414 2.212323 1.379089
O  2.400973 2.212663 -1.001567
O  2.429363 -1.146795 -0.912453
O  -3.697353 -0.075578 1.027966
O  -2.804501 -2.370472 -0.310997
C  0.338498 1.559889 0.161859
C  -0.620319 0.404031 0.549402
C  1.522924 1.081962 -0.706889
C  2.297067 -0.058607 0.014838
C  0.18652 -0.854311 0.980839
C  -3.892066 -0.197141 -1.872635
C  3.342142 -2.210667 -0.455434
H  -0.218142 2.34904 -0.366344
H  -1.287591 0.771886 1.353281
H  1.162774 0.708623 -1.678816
H  3.280747 0.291353 0.385198
H  -0.188421 -1.29898 1.914309
H  0.156485 -1.603881 0.169141
H  1.291453 1.489984 1.921432
H  2.432328 2.769872 -0.175933
H  -4.875522 -0.68682 -1.883363
H  -3.957545 0.89572 -1.802143
H  -3.243123 -0.528793 -2.693565
H  2.985023 -2.659955 0.488991
H  4.365078 -1.80884 -0.312374
H  3.345787 -2.963197 -1.25769
