program: Gaussian 09
title: 000252850
version: EM64L-G09RevD.01
frameworkgroup: C1[X(C9H8Cl3N3O4S)]
method: RPBEPBE
basis: SDD
operation: Freq
keyword: #p
keyword: freq=noraman
keyword: PBEPBE/SDD
title: #p freq=noraman PBEPBE/SDD
converged: YES YES NO NO
title: Mulliken charges:
elementType: Cl Cl Cl S O O O O N N N C C C C C C C C C H H H H H H H H
charge: 0.128116 0.122762 0.125738 0.416906 -0.187827 -0.188535 -0.203797 -0.201040 -0.127304 0.002039 0.000985 0.281144 0.281308 0.288279 -0.310297 -0.328988 -0.285944 -0.644549 -0.644810 -0.691298 0.312889 0.313070 0.248630 0.244746 0.276409 0.250042 0.245025 0.276300
chargesum: 0.00000
title: Mulliken charges with hydrogens summed into heavy atoms:
elementType: Cl Cl Cl S O O O O N N N C C C C C C C C C
charge: 0.128116 0.122762 0.125738 0.416906 -0.187827 -0.188535 -0.203797 -0.201040 -0.127304 0.002039 0.000985 0.281144 0.281308 0.288279 0.002593 -0.015918 -0.285944 0.125236 0.126556 -0.691298
polarizability: 2.84950971e+02 2.07423463e+00 2.11495324e+02 2.23157574e+01 -4.60704665e+00 1.25565205e+02
1716.lowfreq: -9.0849 -5.5312 -1.5275 -0.0023 -0.0022 -0.0022 15.6977 31.2834 33.0233
frequency: 15.6082 31.2392 33.0124 48.5063 68.3933 76.0366 122.2667 126.2783 131.6302 160.5613 182.3047 209.4306 219.0888 232.6912 242.3267 257.4008 261.9362 275.7304 284.0492 290.8698 303.1335 328.8753 353.3142 369.7434 384.1861 389.5252 407.0177 423.8186 437.9174 514.8142 567.1458 612.9732 641.5991 648.0385 665.9298 684.3129 689.8114 691.0341 699.4116 723.9280 738.4897 833.3097 869.9033 927.1687 945.4053 949.5244 1061.7699 1088.2439 1092.7141 1128.2907 1130.5349 1163.1180 1168.6745 1191.8073 1205.9650 1239.3213 1341.5408 1349.0750 1362.2440 1366.5969 1404.7903 1429.8786 1433.8902 1464.9062 1466.5409 1477.7229 1479.7686 1524.4003 1525.4652 1596.7116 2976.8554 2982.7387 3065.0661 3067.1639 3105.4525 3109.0861 3181.1203 3183.2234
redmass: 21.1936 7.3980 16.8601 15.1616 7.7125 8.2413 7.1757 7.4018 12.0455 12.4272 5.7450 12.9783 5.5283 4.7013 5.1143 1.3499 5.7493 1.1434 12.3527 7.8012 9.8165 6.0595 5.6786 5.4021 8.6813 6.7941 9.0940 7.4703 4.0927 5.9655 4.0976 6.9736 11.9534 7.8345 10.0904 10.7881 11.9432 9.0763 9.4731 9.1231 7.3125 9.6710 11.8002 1.4988 1.8875 2.1441 1.5408 1.3932 1.8781 1.4084 4.3251 3.0472 1.7880 5.6243 11.1230 2.2184 4.7478 5.4943 6.6908 2.9982 6.7912 1.1637 1.4497 1.1202 1.0671 1.0783 1.0757 3.1121 5.4472 7.2290 1.0338 1.0345 1.1015 1.1021 1.1007 1.1007 1.0921 1.0937
irintensity: 0.0229 1.3732 0.0900 2.8559 0.4049 4.5468 1.9407 5.6192 0.7745 0.2084 1.5191 1.5670 0.5729 4.8079 1.2183 1.9207 0.9139 0.7284 0.8516 0.1811 0.4920 2.1729 1.0515 1.2859 19.9613 0.7180 6.4428 2.5020 1.6076 0.4801 34.4819 24.1438 126.0190 22.2366 18.9340 67.9605 156.6860 41.1285 0.5986 5.7686 17.4850 0.4820 24.0662 18.4117 15.3055 12.6995 9.5218 0.9180 57.8456 4.8685 25.9646 102.1849 10.5733 448.0448 44.7442 31.9599 82.9042 14.9379 72.9804 12.6164 15.5436 18.7647 64.1292 4.3785 18.5720 14.2033 8.8911 95.2212 67.7854 229.0765 29.0022 52.8978 25.6846 3.4296 7.5346 12.3603 14.0759 1.4933
temp: 298.150 k
press: 1.00000 atm
elementType: 17 17 17 16 8 8 8 8 7 7 7 6 6 6 6 6 6 6 6 6 1 1 1 1 1 1 1 1
symmnumber: 1
zpe: 451197.7 jmol-1
zpe.correction: 0.171852 hartree
zpe.thermalcorrener: 0.192571 hartree
zpe.thermalcorrenthalpy: 0.193516 hartree
zpe.thermalcorrgfe: 0.119835 hartree
zpe.sumelectzpe: -2589.444556 hartree
zpe.sumelectthermal: -2589.423837 hartree
zpe.sumelectthermalent: -2589.422893 hartree
zpe.sumelectthermalfe: -2589.496574 hartree
dipole: 2.7711 -0.0123 -0.0197
dipole: 2.7712
quadrupole: -130.2291 -169.3508 -143.6479
quadrupole: 1.9411 5.3267 -2.9610
quadrupole: 17.5135 -21.6082 4.0947 1.9411 5.3267 -2.9610
hfenergy: -2589.6164085 hartree
pointgroup: C01 [X(C9H8Cl3N3O4S1)]
dipole: -1.0890733 0.0487851 -0.014791 debye
polarizability: 285.657569|3.4733223|205.3419846|-19.3321587|22.8001021|131.0119468 unknown
InChI: InChI=1S/C9H8Cl3N3O4S/c1-13(2)8-6(14(16)17)3-5(20-9(10,11)12)4-7(8)15(18)19/h3-4H,1-2H3
charge 0 multiplicity 1
28 atoms
Cl 5.768284 -0.119131 -0.193559
Cl 3.53155 -1.911096 0.815749
Cl 3.611732 0.992335 1.63372
S  3.055806 0.282176 -1.354939
O  -0.589036 3.45873 0.948461
O  -0.939202 -3.2781 -1.468644
O  -2.490785 2.818833 -0.138024
O  -2.04665 -2.815208 0.472406
N  -2.814026 -0.018732 0.342697
N  -1.309242 2.578847 0.333037
N  -1.306129 -2.46763 -0.530314
C  -1.487421 0.044083 -0.031772
C  -0.699642 1.253374 0.069427
C  -0.76208 -1.089146 -0.561852
C  0.669367 1.306802 -0.254981
C  0.580888 -1.013467 -0.9793
C  1.310641 0.177379 -0.800062
C  -3.806761 -0.852867 -0.358635
C  -3.360517 0.750424 1.475408
C  3.960846 -0.188547 0.22822
H  1.199645 2.255071 -0.134848
H  1.055804 -1.91123 -1.383466
H  -3.431934 -1.159843 -1.347864
H  -4.715409 -0.242652 -0.512681
H  -4.064152 -1.75939 0.218884
H  -2.550772 1.107902 2.131034
H  -4.005054 0.074595 2.066526
H  -3.951051 1.620485 1.134775
