program: Gaussian 09
title: 000252837
version: EM64L-G09RevD.01
frameworkgroup: C1[X(C10H19N)]
method: RPBEPBE
basis: SDD
operation: Freq
keyword: #pfreq=noraman
keyword: PBEPBE/SDD
title: #p freq=noraman PBEPBE/SDD
converged: YES YES NO NO
title: Mulliken charges:
elementType: N C C C C C C C C C C H H H H H H H H H H H H H H H H H H H
charge: -0.022086 -0.054062 -0.416182 -0.416179 -0.360485 -0.360487 -0.356151 -0.356149 -0.218304 -0.696438 -0.696439 0.236530 0.210781 0.200518 0.210781 0.200522 0.224005 0.186333 0.224010 0.186335 0.200377 0.193011 0.193010 0.200374 0.217208 0.215899 0.210081 0.217207 0.210081 0.215899
chargesum: 0.00000
title: Mulliken charges with hydrogens summed into heavy atoms:
elementType: N C C C C C C C C C C
charge: -0.022086 0.182469 -0.004882 -0.004876 0.049853 0.049857 0.037236 0.037234 -0.218304 -0.053250 -0.053251
polarizability: 1.34175223e+02 3.82004476e-03 1.09615900e+02 -7.69827220e-04 -1.32875831e+00 8.98384153e+01
1716.lowfreq: -6.2766 -2.2528 -0.0005 0.0002 0.0004 7.2283 41.4263 55.3433 55.9997
frequency: 40.7752 55.1390 55.9913 71.4812 74.8172 116.1989 131.9075 150.1432 182.2406 220.5523 230.4377 231.9994 246.0302 278.1344 386.2647 394.6185 458.7124 552.4159 599.1584 728.6173 730.1737 754.9914 782.8295 830.9034 891.3542 892.8089 911.9359 953.8178 986.8338 1021.6666 1040.0380 1049.3627 1065.8876 1084.2405 1089.9905 1116.4267 1130.2630 1135.6654 1201.7729 1212.8126 1231.7157 1266.0234 1273.2234 1275.3728 1285.5690 1294.9813 1295.0919 1323.9380 1327.1448 1335.6853 1354.4843 1361.7738 1390.4666 1390.7031 1457.4847 1465.7418 1467.1965 1467.8700 1476.9246 1477.2571 1477.3165 1478.3858 1487.6768 1487.9566 2183.5249 2959.9953 2960.2694 2966.5320 2966.7275 2967.7759 2974.7676 2974.9339 2975.5904 2980.4300 3001.7686 3002.3509 3020.9857 3024.0906 3045.0029 3050.4036 3071.5341 3071.7243 3074.3669 3074.4654
redmass: 3.3323 1.4975 2.4475 2.2258 3.9186 3.3957 2.2085 2.2957 2.6280 1.5369 1.1559 2.3132 2.7480 3.4131 2.7918 5.1825 3.1847 3.2549 3.8955 1.1745 1.0827 1.7045 1.1986 1.5110 1.7594 1.9025 1.2761 1.2951 4.3983 2.7762 1.4292 3.4240 2.4170 2.3647 1.9301 2.2768 1.5882 2.7877 1.5398 1.4219 1.2292 1.2778 1.2681 1.2708 1.1605 1.0752 1.0928 1.4272 1.2919 1.4025 1.5881 1.5713 1.2136 1.2162 1.0770 1.0697 1.0708 1.0742 1.0637 1.0424 1.0467 1.0679 1.0828 1.0842 12.5314 1.0593 1.0596 1.0691 1.0600 1.0702 1.0362 1.0362 1.0599 1.0622 1.0972 1.0973 1.1024 1.1023 1.1050 1.1036 1.1005 1.1005 1.0996 1.0996
irintensity: 0.0869 0.0790 0.1134 1.1609 2.8331 1.6695 0.0758 0.0488 0.6494 0.1229 0.0033 0.0947 0.5001 0.6948 0.0812 0.5502 0.1933 2.0192 2.1212 16.2832 0.0256 3.2387 0.0183 0.1016 3.6837 4.0051 0.6633 5.7547 0.4895 1.5268 0.8169 1.2209 5.5211 0.6075 13.3528 6.1579 0.5477 2.6645 0.7935 0.4239 7.0128 0.4253 0.0035 0.1203 0.0238 1.3139 1.1293 0.0973 0.1818 1.5705 3.7725 0.7920 12.8484 9.8126 0.0067 0.3439 0.7254 0.4264 3.1415 25.7561 1.1883 2.7847 2.0050 33.9109 9.6225 0.9585 2.4629 26.7836 0.1530 47.3557 58.2106 17.3291 0.2287 117.4551 0.0013 7.4570 0.0334 11.9289 0.1215 92.5102 6.6872 158.8504 31.6566 75.2835
temp: 298.150 k
press: 1.00000 atm
elementType: 7 6 6 6 6 6 6 6 6 6 6 1 1 1 1 1 1 1 1 1 1 1 1 1 1 1 1 1 1 1
symmnumber: 1
zpe: 703324.3 jmol-1
zpe.correction: 0.267882 hartree
zpe.thermalcorrener: 0.282317 hartree
zpe.thermalcorrenthalpy: 0.283261 hartree
zpe.thermalcorrgfe: 0.225352 hartree
zpe.sumelectzpe: -446.303272 hartree
zpe.sumelectthermal: -446.288837 hartree
zpe.sumelectthermalent: -446.287893 hartree
zpe.sumelectthermalfe: -446.345802 hartree
dipole: -0.0006 -4.0068 0.6721
dipole: 4.0627
quadrupole: -67.2596 -82.1478 -69.2559
quadrupole: -0.0019 0.0003 1.1781
quadrupole: 5.6282 -9.2600 3.6319 -0.0019 0.0003 1.1781
hfenergy: -446.5711542 hartree
pointgroup: C01 [X(C10H19N1)]
dipole: -0.0013563 -1.587867 0.18323 debye
polarizability: 134.1752039|-0.0150451|109.700005|-0.0221956|-0.3087189|89.75433 unknown
InChI: InChI=1S/C10H19N/c1-3-5-7-10(9-11)8-6-4-2/h10H,3-8H2,1-2H3
charge 0 multiplicity 1
30 atoms
N  0.003854 2.579473 -0.181169
C  0.001585 -0.058131 0.258626
C  -1.292475 -0.706497 -0.321269
C  1.294076 -0.708565 -0.322448
C  -2.601657 -0.170112 0.29683
C  2.604676 -0.174134 0.294321
C  -3.860353 -0.842244 -0.298179
C  3.861735 -0.848349 -0.301791
C  0.002652 1.403557 0.025418
C  -5.170533 -0.308953 0.320226
C  5.173349 -0.316924 0.315176
H  0.001979 -0.207661 1.359421
H  -1.307317 -0.556348 -1.418931
H  -1.220547 -1.799294 -0.14823
H  1.30809 -0.558536 -1.420137
H  1.220627 -1.801238 -0.14924
H  -2.664779 0.925376 0.140422
H  -2.586309 -0.33048 1.395189
H  2.669378 0.921229 0.137669
H  2.590127 -0.334297 1.39272
H  -3.87497 -0.678997 -1.39502
H  -3.798116 -1.939571 -0.146794
H  3.797955 -1.945543 -0.150076
H  3.875502 -0.685393 -1.398687
H  -6.056118 -0.798633 -0.124377
H  -5.269395 0.780712 0.158438
H  -5.196828 -0.489195 1.411448
H  6.057742 -0.808028 -0.130228
H  5.20048 -0.496987 1.406407
H  5.273692 0.77256 0.153068
