program: Gaussian 09
title: 000260983
version: EM64L-G09RevD.01
frameworkgroup: C1[X(C21H23N5O)]
method: RPBEPBE
basis: SDD
operation: Freq
keyword: #p
keyword: freq=noraman
keyword: PBEPBE/SDD
title: #p freq=noraman PBEPBE/SDD
converged: YES YES NO NO
title: Mulliken charges:
elementType: O N N N N N C C C C C C C C C C C C C C C C C C C C C H H H H H H H H H H H H H H H H H H H H H H H
charge: -0.344311 -0.440835 -0.430334 -0.388014 -0.195771 -0.125819 -0.252505 0.248552 0.145397 0.248961 0.265007 0.003367 -0.028249 -0.579748 -0.593287 0.391225 0.385812 -0.578639 -0.576589 0.374662 0.365828 0.294729 -0.823562 -0.826327 -0.824536 -0.827106 -0.765754 0.288006 0.382271 0.388413 0.365909 0.248533 0.245171 0.248009 0.249720 0.225543 0.232103 0.225525 0.230545 0.224502 0.225321 0.233099 0.224199 0.224003 0.222429 0.223431 0.233220 0.254204 0.228522 0.255169
chargesum: 0.00000
title: Mulliken charges with hydrogens summed into heavy atoms:
elementType: O N N N N N C C C C C C C C C C C C C C C C C C C C C
charge: -0.344311 -0.058564 -0.041921 -0.022105 -0.195771 -0.125819 0.035501 0.248552 0.145397 0.248961 0.265007 0.003367 -0.028249 -0.331215 -0.348116 0.391225 0.385812 -0.330630 -0.326870 0.374662 0.365828 0.294729 -0.140391 -0.145958 -0.143235 -0.148025 -0.027859
polarizability: 4.08738640e+02 -5.37151604e-01 3.05856355e+02 7.41261956e+00 -8.46751271e-01 1.35929960e+02
1716.lowfreq: -4.0444 -0.0004 0.0004 0.0011 2.3898 4.8155 28.7729 40.5947 43.4664
frequency: 28.7618 40.5890 43.4620 51.9927 68.4439 70.2175 85.7008 111.6727 127.4179 130.5440 131.0041 151.8745 162.7846 169.9920 180.0549 189.8305 200.2063 215.8364 231.8722 253.6949 272.6462 300.6888 302.6518 332.6766 336.3005 355.5978 361.0077 369.4477 379.2118 435.7733 439.0566 442.0311 448.9106 484.7691 512.7236 525.8006 575.3905 578.4021 582.6782 612.3878 652.2404 654.3909 668.1327 677.0148 723.6853 726.5400 743.4300 759.6113 772.3617 773.6503 780.2421 786.5061 811.3101 849.1342 866.2037 866.7306 871.4642 886.2949 887.7413 921.1432 949.9055 970.4143 979.5202 999.3829 1000.0098 1003.4300 1005.3775 1007.1954 1026.6810 1031.3069 1031.6983 1048.2729 1052.1973 1052.3665 1085.6634 1099.0908 1113.0226 1168.6040 1172.2045 1198.4615 1208.9898 1219.4263 1248.5396 1251.0753 1259.7553 1281.6635 1293.9402 1310.4560 1320.3708 1324.7490 1383.1927 1391.0142 1391.5052 1392.7645 1394.2642 1395.6320 1405.8062 1407.4932 1421.8978 1437.8442 1442.6822 1451.3114 1459.3193 1460.1614 1461.8283 1462.6557 1466.0847 1476.5723 1476.9690 1478.9574 1479.9923 1489.3300 1491.1163 1501.4278 1510.6762 1521.7462 1581.0192 1582.1231 1600.6014 1647.3563 1652.1209 2914.8183 2967.0974 2967.6726 2968.3036 2968.5862 3003.1471 3037.4835 3039.1088 3040.3239 3041.5208 3080.2485 3081.2450 3083.1273 3084.0284 3099.9529 3111.9409 3139.4848 3142.4775 3145.3512 3147.3883 3148.8609 3166.1366 3372.4293
redmass: 4.2440 3.9454 3.5778 4.2397 1.3036 2.9790 5.1731 5.4732 1.4952 2.3287 1.4919 1.9169 2.2622 2.6541 1.2602 1.4145 4.4430 2.7838 4.0114 5.7358 4.0998 2.5400 2.6070 4.3412 4.6109 4.7309 3.7713 3.7961 4.9924 2.7282 2.8695 4.4156 5.3962 6.0861 4.7430 4.9411 3.5976 3.6238 3.6927 4.6277 3.9686 3.8294 6.1598 4.9292 4.8666 5.0855 1.3667 3.7335 3.6359 3.6527 6.2343 4.9648 5.0553 2.6297 1.4241 1.4120 3.4977 1.4739 1.4710 1.8118 3.0654 2.4122 1.3073 1.5304 1.6434 1.4882 1.5560 1.5314 3.6205 1.4382 1.4395 1.6449 1.6309 1.6289 4.1770 3.8734 4.3041 1.6829 1.7333 3.6621 3.3352 1.6246 1.4712 1.3121 1.7669 1.9107 1.6853 3.0209 3.8100 3.6193 5.1305 3.0903 1.2672 1.2626 1.2815 3.0885 1.3135 1.3416 5.6484 2.5781 2.6716 1.0484 2.2912 1.9778 1.0780 1.0473 1.2733 1.0517 1.0457 1.2868 1.2542 1.6403 1.6871 2.5075 2.9333 2.6193 7.8652 7.9726 4.7304 7.7147 7.2097 1.0800 1.0374 1.0381 1.0374 1.0382 1.0357 1.0970 1.0970 1.0969 1.0970 1.0983 1.0985 1.0975 1.0977 1.0978 1.1018 1.0923 1.0925 1.0904 1.0923 1.0917 1.0918 1.0795
irintensity: 0.2474 0.2693 2.8912 4.1028 0.7367 2.9042 5.5719 6.4207 0.2815 4.7439 0.2207 1.9928 2.6390 3.1411 0.2327 3.6104 11.8020 1.3941 6.5218 3.5377 9.9649 0.0920 0.0553 2.2267 1.8336 3.7567 1.3812 3.4518 0.6791 17.6419 0.6635 40.1862 3.9485 1.2289 12.7685 13.2571 6.5683 3.6069 20.0053 9.1945 0.2026 0.1093 0.2930 2.7808 6.2655 0.7194 61.9641 20.3684 0.2247 0.0576 7.1446 17.0481 24.7892 36.5938 27.2398 18.1314 5.0151 4.4796 6.4368 81.1028 3.1486 10.1542 124.7161 23.7744 8.7251 13.8932 2.2087 8.3328 15.0305 11.5303 26.5073 21.3346 0.0074 0.0234 2.8916 19.9459 53.2387 0.7250 10.3535 26.3374 38.7809 17.5137 13.6221 8.0467 11.4776 16.4719 99.5260 29.4675 59.3781 322.6745 30.6979 21.1560 65.5808 2.0455 5.5441 4.4127 9.1236 6.6817 89.5031 28.9352 40.8562 19.0225 71.1312 162.1836 5.5027 0.1766 37.6525 23.3023 34.6360 41.7590 3.9132 30.4586 20.3505 163.1206 220.6392 178.4237 53.7803 2.9200 87.5259 9.7615 8.6271 9.7885 100.7288 20.0841 82.1972 17.4218 7.3348 45.6532 46.2876 1.1487 0.1829 38.3199 39.4602 4.5450 3.8709 6.1326 15.2122 26.9203 9.2315 413.7107 59.2905 131.8445 1409.2986 276.4969
temp: 298.150 k
press: 1.00000 atm
elementType: 8 7 7 7 7 7 6 6 6 6 6 6 6 6 6 6 6 6 6 6 6 6 6 6 6 6 6 1 1 1 1 1 1 1 1 1 1 1 1 1 1 1 1 1 1 1 1 1 1 1
symmnumber: 1
zpe: 1059603.7 jmol-1
zpe.correction: 0.403582 hartree
zpe.thermalcorrener: 0.428560 hartree
zpe.thermalcorrenthalpy: 0.429504 hartree
zpe.thermalcorrgfe: 0.348590 hartree
zpe.sumelectzpe: -1161.172760 hartree
zpe.sumelectthermal: -1161.147782 hartree
zpe.sumelectthermalent: -1161.146837 hartree
zpe.sumelectthermalfe: -1161.227752 hartree
dipole: -0.2152 -0.7295 0.9312
dipole: 1.2023
quadrupole: -139.1061 -142.3679 -162.7838
quadrupole: 3.4270 0.2358 4.6805
quadrupole: 8.9798 5.7180 -14.6979 3.4270 0.2358 4.6805
hfenergy: -1161.576342 hartree
pointgroup: C01 [X(C21H23N5O1)]
dipole: -0.1396284 0.2902597 -0.3464374 debye
polarizability: 405.0115984|11.4088439|306.8923579|-27.215997|3.8343676|138.6209989 unknown
InChI: InChI=1S/C21H23N5O/c1-10-6-15-16(7-11(10)2)24-20(23-15)19(22-14(5)27)21-25-17-8-12(3)13(4)9-18(17)26-21/h6-9,19,22-23,25H,1-5H3
charge 0 multiplicity 1
50 atoms
O  -1.491185 -4.006195 0.357059
N  -2.34917 -1.485653 0.427794
N  1.38519 0.687595 0.479844
N  0.405435 -2.774481 -0.225935
N  -1.265114 0.518295 0.421321
N  2.590676 -1.196715 0.002813
C  0.186449 -1.573153 0.627329
C  -1.128477 -0.829815 0.438887
C  1.395497 -0.69189 0.3715
C  -3.350294 -0.509117 0.375771
C  2.675888 1.129321 0.159336
C  -2.657565 0.746211 0.375076
C  3.424346 -0.061448 -0.132607
C  -4.757302 -0.578231 0.329788
C  3.262633 2.408437 0.089514
C  -5.485307 0.631074 0.288716
C  4.624153 2.501716 -0.274806
C  -3.38988 1.953206 0.332728
C  4.786215 0.038429 -0.492622
C  -4.799284 1.902313 0.290215
C  5.389733 1.312231 -0.564839
C  -0.354223 -3.914432 -0.23073
C  -7.003232 0.589023 0.243017
C  5.284471 3.867016 -0.360702
C  -5.59837 3.193913 0.244961
C  6.855497 1.429958 -0.948752
C  0.219331 -5.094322 -1.001933
H  0.204792 -1.913693 1.688236
H  -2.38251 -2.52915 0.466434
H  0.461224 1.171024 0.56344
H  1.360012 -2.778717 -0.621803
H  -5.282642 -1.53899 0.327971
H  2.688366 3.314014 0.312075
H  -2.867545 2.915474 0.332147
H  5.364023 -0.865439 -0.711467
H  -7.398133 1.083883 -0.6653
H  -7.374433 -0.449724 0.2484
H  -7.452489 1.11225 1.109195
H  4.576726 4.671227 -0.096734
H  6.153106 3.945023 0.321391
H  5.663358 4.073568 -1.380529
H  -4.932335 4.073253 0.253806
H  -6.225631 3.256217 -0.665308
H  -6.283986 3.28245 1.109803
H  6.99403 2.049883 -1.855709
H  7.452907 1.904375 -0.145947
H  7.293625 0.437755 -1.150052
H  -0.491024 -5.389037 -1.793149
H  1.200183 -4.882182 -1.458055
H  0.319269 -5.953051 -0.315985
