program: Gaussian 09
title: 000260889
version: EM64L-G09RevD.01
frameworkgroup: C1[X(C9H20OSi)]
method: RPBEPBE
basis: SDD
operation: Freq
keyword: #p
keyword: freq=noraman
keyword: PBEPBE/SDD
title: #p freq=noraman PBEPBE/SDD
converged: YES YES NO NO
title: Mulliken charges:
elementType: Si O C C C C C C C C C H H H H H H H H H H H H H H H H H H H H
charge: 1.305930 -0.448364 -0.515317 -0.431504 -0.393440 -0.064528 -0.413497 -0.409095 -1.026360 -1.021457 -1.033314 0.213189 0.188012 0.214431 0.198026 0.202820 0.178650 0.202626 0.196005 0.219120 0.203939 0.231157 0.234033 0.234536 0.231386 0.233001 0.234703 0.235972 0.236475 0.236304 0.326561
chargesum: 0.00000
title: Mulliken charges with hydrogens summed into heavy atoms:
elementType: Si O C C C C C C C C C
charge: 1.305930 -0.121803 -0.302128 -0.029062 0.007406 0.114122 -0.014866 0.013964 -0.326634 -0.322367 -0.324563
polarizability: 1.37418536e+02 4.87158745e-01 1.23272266e+02 1.75463762e+00 4.29894323e-01 1.07393184e+02
1716.lowfreq: -21.3129 -0.0010 -0.0010 0.0013 5.2887 13.5900 25.8171 80.9037 97.8599
frequency: 25.2809 80.8302 97.8029 114.4236 125.8868 140.8302 152.9510 169.1565 179.3081 189.9127 209.8941 246.2919 278.0669 305.7818 319.2089 343.7412 391.3098 433.5640 462.5094 500.2134 591.5413 686.3700 688.6847 713.0613 732.3099 790.4822 795.8892 799.2653 845.1376 867.2422 889.5393 895.7059 898.6672 914.8736 929.2254 945.2083 1005.6812 1039.3472 1061.3204 1088.9459 1095.2207 1107.8317 1160.5870 1199.4388 1234.2507 1256.4020 1261.1728 1278.2735 1289.7308 1290.5461 1301.5472 1306.2747 1315.5065 1330.2529 1337.6452 1343.7333 1396.5127 1443.2668 1446.2136 1446.6410 1452.7215 1455.0953 1458.7616 1460.6316 1464.5641 1465.4918 1476.3749 2918.2944 2930.5099 2953.4234 2961.0173 2967.3162 2977.6525 2978.3428 2979.5750 2987.7999 3014.9599 3023.1774 3033.0741 3057.0043 3078.5650 3079.3385 3081.0302 3081.5490 3082.5145 3082.6306 3549.1477
redmass: 2.8781 2.7504 1.6763 1.4617 1.0236 1.1032 2.6207 2.4565 2.5881 2.5908 2.4345 3.0258 2.0373 1.1156 3.9309 3.2563 3.5729 2.0824 2.3042 2.7405 3.6484 3.3637 3.0998 2.1755 1.1678 1.7787 1.3949 1.6142 1.6438 1.6802 1.7078 1.5438 1.6746 1.6603 2.3330 2.4414 3.2541 1.8513 1.0738 1.9458 2.3428 2.2243 1.3095 1.3984 1.3208 1.2522 1.3128 1.2108 1.2082 1.2046 1.2001 1.2557 1.3108 1.4024 1.4236 1.3743 1.6725 1.0562 1.0542 1.0566 1.0721 1.0589 1.0622 1.0699 1.0652 1.0834 1.0962 1.0834 1.0802 1.0590 1.0613 1.0629 1.0342 1.0343 1.0343 1.0628 1.1012 1.0977 1.1002 1.1023 1.0982 1.0981 1.0987 1.0975 1.0976 1.0976 1.0658
irintensity: 0.0900 1.1324 0.1577 0.2657 0.0234 0.0506 2.0446 0.5230 0.5548 1.3049 0.4199 1.3690 1.1695 150.2876 3.1341 14.7026 1.5927 4.3394 4.7334 8.3165 6.3184 10.7236 11.4864 0.9332 0.0242 1.0377 17.2112 11.4685 10.8227 9.6696 7.2636 63.5934 70.4875 202.5304 2.7364 40.0377 62.1028 0.8344 3.1558 15.0895 20.4375 15.3970 3.7783 26.2648 14.3222 5.9716 4.4822 4.9765 46.7391 46.5214 19.2952 0.4973 4.1245 1.5567 0.9684 28.3308 5.8066 0.2374 0.1113 0.5858 11.2001 10.7484 5.4375 1.9584 16.5408 16.5804 6.1734 42.4856 17.7994 43.2419 30.9708 36.3284 20.0569 19.0467 8.5609 24.3316 43.0731 41.4351 71.3393 61.5719 1.8137 1.9869 0.5847 44.0942 40.9994 35.5258 3.5773
temp: 298.150 k
press: 1.00000 atm
elementType: 14 8 6 6 6 6 6 6 6 6 6 1 1 1 1 1 1 1 1 1 1 1 1 1 1 1 1 1 1 1 1
symmnumber: 1
zpe: 710803.5 jmol-1
zpe.correction: 0.270731 hartree
zpe.thermalcorrener: 0.285869 hartree
zpe.thermalcorrenthalpy: 0.286813 hartree
zpe.thermalcorrgfe: 0.229011 hartree
zpe.sumelectzpe: -718.673157 hartree
zpe.sumelectthermal: -718.658019 hartree
zpe.sumelectthermalent: -718.657075 hartree
zpe.sumelectthermalfe: -718.714878 hartree
dipole: -1.7325 -0.0076 -1.0386
dipole: 2.0200
quadrupole: -88.0398 -74.6745 -77.9395
quadrupole: 1.9535 -3.4415 2.0930
quadrupole: -7.8218 5.5434 2.2784 1.9535 -3.4415 2.0930
hfenergy: -718.9438881 hartree
pointgroup: C01 [X(C9H20O1Si1)]
dipole: -0.6824504 -0.0005437 -0.4072563 debye
polarizability: 137.4247867|0.4865253|123.265862|1.6968385|0.546699|107.3933369 unknown
InChI: InChI=1S/C9H20OSi/c1-11(2,3)9-6-4-5-8(10)7-9/h8-10H,4-7H2,1-3H3
charge 0 multiplicity 1
31 atoms
Si -2.091606 -0.171258 -0.000657
O  3.111058 -1.663271 0.145086
C  -0.238342 0.205111 -0.431465
C  0.719763 -0.93767 0.011813
C  0.246709 1.561276 0.156483
C  2.186001 -0.630294 -0.366903
C  1.723266 1.857455 -0.207984
C  2.654984 0.703164 0.229899
C  -2.596192 -1.857562 -0.763778
C  -3.202577 1.212202 -0.729136
C  -2.324649 -0.241401 1.901677
H  -0.187729 0.282423 -1.542497
H  0.412505 -1.899929 -0.449771
H  0.672449 -1.072316 1.112349
H  0.150724 1.537054 1.262653
H  -0.397975 2.386914 -0.204213
H  2.257607 -0.579038 -1.47868
H  2.050675 2.8033 0.265572
H  1.804086 2.004825 -1.304979
H  3.699397 0.894863 -0.078237
H  2.65158 0.607323 1.33402
H  -2.437493 -1.866421 -1.858429
H  -2.012363 -2.688683 -0.326743
H  -3.666343 -2.065343 -0.577175
H  -3.081837 1.283797 -1.82625
H  -4.26963 1.010851 -0.519415
H  -2.954871 2.198412 -0.294624
H  -3.370812 -0.495009 2.15575
H  -1.672413 -1.006825 2.361538
H  -2.091916 0.731606 2.372227
H  2.819844 -2.547153 -0.19693
