program: Gaussian 09
title: 000260882
version: EM64L-G09RevD.01
frameworkgroup: C1[X(C7H16OSi)]
method: RPBEPBE
basis: SDD
operation: Freq
keyword: #p
keyword: freq=noraman
keyword: PBEPBE/SDD
title: #p freq=noraman PBEPBE/SDD
converged: YES YES NO NO
title: Mulliken charges:
elementType: Si O C C C C C C C H H H H H H H H H H H H H H H H
charge: 1.259597 -0.249722 -0.821728 -0.037676 -0.643845 -0.292354 -1.018136 -1.025903 -0.714038 0.233119 0.214893 0.218871 0.198321 0.236560 0.166107 0.214480 0.233975 0.251078 0.230114 0.236205 0.238128 0.233150 0.215315 0.204902 0.218585
chargesum: 0.00000
title: Mulliken charges with hydrogens summed into heavy atoms:
elementType: Si O C C C C C C C
charge: 1.259597 -0.249722 -0.373715 0.181195 -0.208965 0.088233 -0.302969 -0.318419 -0.075236
polarizability: 1.18165040e+02 4.01080715e-01 9.40187622e+01 -1.07030232e+00 -3.71646657e-02 9.24010273e+01
1716.lowfreq: -13.2531 0.0023 0.0025 0.0032 10.1708 11.7099 72.3716 89.1849 116.2289
frequency: 72.2697 89.1716 116.2206 126.4770 167.3071 176.6471 189.0190 202.0758 224.3111 289.9159 298.7103 334.4908 348.1038 405.1093 490.6181 600.5255 673.8698 700.9020 710.1794 717.1263 766.9922 812.9334 822.6690 851.0523 857.0311 899.8776 908.8803 933.8407 947.6305 1020.2643 1033.8722 1064.8530 1142.4125 1157.2644 1208.4569 1216.6508 1265.2337 1273.5102 1290.9115 1294.0278 1300.8084 1333.9958 1353.2696 1384.4715 1422.7211 1429.9339 1445.4519 1447.3587 1450.5291 1454.3760 1458.5867 1473.1049 1474.8291 2911.5514 2920.9093 2957.4933 2965.8885 2977.9841 2980.5159 2980.6225 3025.2386 3052.1097 3057.3767 3062.0493 3070.0446 3079.3261 3081.5506 3082.6833 3087.9588
redmass: 2.3800 2.8266 1.0505 1.0725 2.4719 2.3918 2.3878 1.1055 2.2106 3.1319 2.5099 4.2927 3.6179 1.8155 3.6276 3.4092 2.8963 3.3523 2.6145 1.3892 1.4662 1.6448 2.2711 2.0400 2.0080 1.5157 1.7221 1.7150 1.6023 4.0825 1.4284 2.4346 2.2235 1.2922 1.3820 1.3048 1.2464 1.2101 1.2379 1.2644 1.1934 1.3530 1.2769 1.2041 1.0740 1.0883 1.0570 1.0588 1.0778 1.0492 1.0501 1.0448 1.0556 1.0679 1.0663 1.0605 1.0360 1.0345 1.0743 1.0407 1.0986 1.0952 1.0938 1.0986 1.0992 1.0981 1.0982 1.0981 1.0982
irintensity: 0.5628 0.9639 0.0358 0.0646 1.3508 0.5112 0.8449 0.9320 3.6301 8.1757 1.4080 4.9386 1.4889 2.0967 5.6918 8.5836 1.2835 16.6017 5.9620 1.4532 20.2822 9.0149 3.1279 31.7309 42.2515 85.5445 74.3792 12.7509 6.6724 63.3173 28.8050 19.2274 11.5875 10.9692 10.6531 13.5789 3.7354 1.1028 34.3036 15.3605 19.2539 3.4215 1.0679 15.3121 7.4574 5.1480 1.9111 1.1307 11.1056 8.6903 13.1629 15.5454 8.2413 48.9139 75.7283 15.5465 45.0515 18.2108 16.3456 27.8366 24.6573 15.7313 15.7175 78.5878 40.0062 5.9866 23.5974 27.1862 15.0134
temp: 298.150 k
press: 1.00000 atm
elementType: 14 8 6 6 6 6 6 6 6 1 1 1 1 1 1 1 1 1 1 1 1 1 1 1 1
symmnumber: 1
zpe: 564781.9 jmol-1
zpe.correction: 0.215114 hartree
zpe.thermalcorrener: 0.227365 hartree
zpe.thermalcorrenthalpy: 0.228310 hartree
zpe.thermalcorrgfe: 0.177728 hartree
zpe.sumelectzpe: -640.205575 hartree
zpe.sumelectthermal: -640.193324 hartree
zpe.sumelectthermalent: -640.192379 hartree
zpe.sumelectthermalfe: -640.242961 hartree
dipole: 0.3214 -1.6313 -0.8230
dipole: 1.8552
quadrupole: -61.9977 -69.3427 -64.6358
quadrupole: 2.0885 0.3223 -2.0433
quadrupole: 3.3277 -4.0173 0.6896 2.0885 0.3223 -2.0433
hfenergy: -640.4206889 hartree
pointgroup: C01 [X(C7H16O1Si1)]
dipole: 0.1292546 0.6295459 0.3459851 debye
dipolederiv: 1.3112625 0.0246215 0.013004 0.0319205 1.0035744 0.0080305 -0.0231422 0.0218211 1.1711278 -0.9230187 0.0415446 -0.0583185 0.0255187 -0.5843873 0.0132458 0.0038199 0.0281515 -0.3673174 -0.4589609 0.0207404 -0.035748 -0.0647241 -0.2176128 -0.0395757 -0.0532756 0.0039182 -0.1686887 0.1049697 -0.0299614 -0.0017598 0.1820736 -0.0125469 0.0273301 0.1254742 0.0304755 0.1080734 0.2340842 0.0223231 0.0498981 0.16031 0.0115232 0.0065305 0.1339072 -0.062754 0.0420868 0.5368855 -0.0644537 -0.0371545 -0.2773833 0.3946405 -0.0215369 -0.152238 -0.0472258 0.348657 -0.3407665 -0.0094694 0.0423326 -0.0237261 -0.2541106 -0.0115153 0.059566 0.0012077 -0.4590446 -0.4351606 -0.0532567 -0.0831068 -0.0732283 -0.2780086 -0.0309514 -0.0736509 -0.0376213 -0.3524049 -0.0699885 0.049929 0.0210139 0.0494526 0.0066389 -0.0083015 -0.0330144 0.0141544 0.0979444 0.0802046 0.0273107 -0.0237939 -0.0271261 -0.1653808 0.0715939 -0.0152701 0.0774612 0.0565666 0.0365031 0.0036066 0.1002629 -0.0073125 0.0701096 -0.0287114 0.0252045 -0.0581139 -0.1493142 0.0387298 -0.006938 0.044775 -0.0041629 0.03078 -0.0207405 0.0183089 -0.0082912 -0.1641025 -0.0178394 -0.0356579 0.0652923 -0.0613147 0.0410219 0.067312 -0.0476114 0.0975151 -0.2163455 -0.0246431 0.0905216 0.0099899 0.1230184 -0.0752945 -0.0549352 0.023252 -0.0644979 0.0797176 0.0213073 0.0313528 -0.0222792 0.0723022 0.007956 -0.0227618 0.1052914 0.0216055 -0.2192538 -0.1559272 -0.0786278 -0.0432539 -0.0652297 0.0105317 -0.0185943 -0.0788395 -0.0445565 0.0581371 -0.1012918 0.0959603 0.0620834 0.1013086 0.0521486 -0.0202162 0.0773984 -0.0299029 0.0874264 0.0376514 -0.0500911 -0.1096304 -0.0447228 0.0696242 -0.0561098 -0.132162 -0.0637972 -0.0041585 0.0936086 -0.0328585 0.0170736 -0.0424433 -0.106437 0.0922668 0.0285449 0.1015376 0.0556384 -0.116182 0.1073077 0.0047674 0.107485 0.0481843 -0.0043901 -0.0102721 -0.0028021 0.101422 0.0632922 -0.0858808 0.0081472 -0.0958421 -0.1237982 0.0165882 -0.0099919 0.0089976 0.1023893 0.1043235 0.0000056 0.038516 0.0028711 0.0991875 0.005386 0.0444728 0.0080705 -0.152274 -0.1629601 -0.048229 -0.0734742 -0.1145368 0.0433432 -0.0634564 -0.0972562 -0.0484103 0.0462054 0.0660711 0.0095872 -0.0070205 0.003722 0.0864422 0.0196953 0.077438 -0.0245006 -0.1664716 0.0778453 -0.029387 0.0183833 0.04177 -0.1581295 0.0738175 0.004046 0.0775578 0.0639835 unknown
polarizability: 118.1279526|-0.6841922|94.0309876|1.3320403|-0.0024516|92.4258889 unknown
InChI: InChI=1S/C7H16OSi/c1-7-4-8-6-9(2,3)5-7/h7H,4-6H2,1-3H3
charge 0 multiplicity 1
25 atoms
Si 1.353427 0.230529 0.037214
O  -0.535686 -1.836012 -0.232788
C  -0.263052 1.234407 0.315067
C  -1.505487 0.50944 -0.282489
C  0.763026 -1.565357 0.439016
C  -1.618587 -0.950741 0.224949
C  1.919124 0.327413 -1.787209
C  2.746293 0.794116 1.224593
C  -2.811018 1.275508 0.03766
H  -0.17573 2.251938 -0.115659
H  -0.414174 1.368691 1.407942
H  -1.388393 0.457227 -1.385028
H  0.656036 -1.716257 1.538173
H  1.447019 -2.343292 0.055786
H  -1.669277 -0.956607 1.339563
H  -2.536197 -1.419671 -0.172864
H  2.879732 -0.199921 -1.935008
H  1.168161 -0.145725 -2.445899
H  2.053766 1.3752 -2.113842
H  3.659161 0.184349 1.091527
H  3.018533 1.850135 1.039755
H  2.429596 0.707475 2.28055
H  -3.690482 0.8019 -0.43873
H  -2.990023 1.308637 1.130149
H  -2.749066 2.31892 -0.322228
