program: Gaussian 09
title: 000260880
version: EM64L-G09RevD.01
frameworkgroup: C1[X(C7H15ClO2Si)]
method: RPBEPBE
basis: SDD
operation: Freq
keyword: #p
keyword: freq=noraman
keyword: PBEPBE/SDD
title: #p freq=noraman PBEPBE/SDD
converged: YES YES NO NO
title: Mulliken charges:
elementType: Cl Si O O C C C C C C C H H H H H H H H H H H H H H H
charge: -0.090598 1.295703 -0.266995 -0.239169 -0.786105 -0.882062 -1.004586 -1.016362 -0.466537 0.244563 -0.504597 0.254366 0.252710 0.274576 0.278026 0.233212 0.236997 0.254091 0.244293 0.239075 0.233408 0.262326 0.237727 0.239819 0.242786 0.233331
chargesum: 0.00000
title: Mulliken charges with hydrogens summed into heavy atoms:
elementType: Cl Si O O C C C C C C C
charge: -0.090598 1.295703 -0.266995 -0.239169 -0.279029 -0.329459 -0.280285 -0.299586 0.033516 0.244563 0.211340
polarizability: 1.29581301e+02 -7.05431007e+00 1.12231703e+02 -1.42775187e+00 -2.27985085e+00 1.02198648e+02
1716.lowfreq: -16.5616 -8.5508 -0.0007 0.0017 0.0018 7.1723 18.2535 28.8669 52.7120
frequency: 17.1729 28.7768 52.5931 68.2710 80.9552 86.9064 104.6780 109.9517 122.7157 157.3324 174.3639 180.4559 196.9963 203.3944 272.2038 285.5696 290.6132 416.0503 556.6081 563.5049 610.5063 649.4294 672.6532 697.5854 709.2122 721.3388 745.5425 804.2716 821.2732 849.3145 891.3663 906.9975 941.5640 950.0647 1056.1708 1085.2267 1113.4122 1119.6556 1147.6840 1159.1751 1186.4188 1211.1151 1276.5446 1292.8750 1302.4807 1331.0503 1417.3831 1421.8175 1438.1352 1445.8590 1448.2958 1449.2593 1452.5214 1453.4228 1457.7839 1464.3357 1648.4407 2976.9488 2980.5865 2984.7706 2996.8512 3003.5120 3036.0043 3045.3117 3066.1510 3082.9785 3084.0806 3087.7848 3092.7210 3105.0424 3116.8866 3148.1547
redmass: 6.0415 8.1406 2.7392 2.9489 2.7650 1.0886 1.1411 2.4118 1.1424 3.2179 2.8471 2.3325 2.9494 3.2864 3.9692 4.4735 3.7288 4.0585 2.9952 4.1358 5.2587 3.4655 1.9106 2.7854 2.3018 2.5205 1.5280 1.4888 1.7600 3.0626 1.5999 1.6425 2.3374 3.2945 3.7902 1.0481 1.2855 2.3189 1.4387 1.4373 1.1775 1.3670 1.1383 1.1959 1.1914 1.6301 1.0814 1.1805 1.0652 1.0565 1.0570 1.0884 1.0502 1.0523 1.0523 1.0506 8.9639 1.0648 1.0346 1.0343 1.0590 1.0296 1.0560 1.0952 1.0982 1.0981 1.0982 1.0980 1.0984 1.1045 1.1076 1.1047
irintensity: 1.7757 1.3553 0.1777 0.9519 0.4401 0.2574 0.0949 0.4221 0.0413 4.9427 1.2391 2.8386 2.8877 10.3024 9.8249 22.1771 2.0060 0.4635 3.5148 4.5674 15.5160 2.8348 4.6914 2.2554 13.7788 6.3996 17.8214 25.1779 40.5263 28.4601 59.4775 127.6519 41.9282 10.4152 46.4648 18.6396 5.8044 169.7634 6.7058 78.5115 3.8654 103.4069 7.2516 42.3730 20.0912 33.3627 20.0239 15.8471 1.5587 0.2426 3.4190 18.6999 13.5354 11.6431 26.8889 13.2585 155.8055 8.6686 16.0484 11.0207 11.2968 34.2525 14.1223 1.4945 12.6165 16.7155 8.8995 23.9484 10.7524 27.5204 11.1089 16.6971
temp: 298.150 k
press: 1.00000 atm
elementType: 17 14 8 8 6 6 6 6 6 6 6 1 1 1 1 1 1 1 1 1 1 1 1 1 1 1
symmnumber: 1
zpe: 545061.0 jmol-1
zpe.correction: 0.207603 hartree
zpe.thermalcorrener: 0.223982 hartree
zpe.thermalcorrenthalpy: 0.224926 hartree
zpe.thermalcorrgfe: 0.160732 hartree
zpe.sumelectzpe: -1174.763987 hartree
zpe.sumelectthermal: -1174.747608 hartree
zpe.sumelectthermalent: -1174.746664 hartree
zpe.sumelectthermalfe: -1174.810858 hartree
dipole: 0.0546 -1.2195 2.2110
dipole: 2.5256
quadrupole: -71.7365 -87.8476 -83.2351
quadrupole: -8.8453 -1.4938 -2.0672
quadrupole: 9.2032 -6.9078 -2.2954 -8.8453 -1.4938 -2.0672
hfenergy: -1174.9715897 hartree
pointgroup: C01 [X(C7H15Cl1O2Si1)]
dipole: 0.0538864 0.583736 -0.8023125 debye
dipolederiv: -0.2111673 -0.0173419 0.0129492 -0.0086075 -0.5983552 0.1009135 0.0106005 0.0903431 -0.2148213 1.4117771 -0.0190994 0.0569623 0.0281324 1.2508525 -0.0302815 -0.0131167 0.134265 1.1149433 -1.3406046 -0.2625501 -0.2574973 -0.3697364 -0.4573281 -0.2048651 -0.3693417 -0.2168317 -0.5763181 -0.7042492 0.0746512 0.1713792 -0.1261961 -0.4624704 -0.2494624 -0.1163346 -0.2839603 -0.7421083 -0.3864227 -0.022361 -0.0051046 -0.0172119 -0.2088553 -0.0111961 -0.026533 -0.0060152 -0.259573 -0.1721681 0.0600662 -0.022205 0.0402363 0.2146014 -0.1867731 -0.0011672 -0.2236754 -0.0924391 -0.4184524 -0.0055935 -0.1004319 -0.0101764 -0.3067896 0.0198703 -0.0709251 -0.0119812 -0.3700686 -0.3409619 0.0004146 0.0010072 -0.0254692 -0.4488886 0.0924409 0.0404657 0.0098515 -0.3288845 -0.2722044 -0.0205848 0.0401548 -0.0142837 0.1127732 -0.0503559 0.3368904 -0.0471337 -0.0029107 1.4943918 0.1816436 0.0310875 0.4639541 0.5316897 0.4841319 0.3255196 0.5266484 0.9842558 0.6215079 0.0707293 0.0514346 0.0049861 0.2647107 -0.0230832 -0.0442521 -0.0294987 0.2278867 0.093661 0.0801703 0.0340586 0.0158412 -0.0204916 -0.0762176 -0.0312461 -0.0894788 0.0374998 0.0686506 -0.0539992 0.0198108 -0.025674 -0.0074356 0.1068695 -0.0388823 0.0861881 -0.0129563 0.0688257 -0.0420483 -0.0941807 -0.0572662 -0.0132837 0.0126996 -0.1071621 0.0191309 -0.0717055 -0.0867801 0.0216997 0.0840198 0.0478439 -0.000525 0.0347917 0.0900618 0.0334887 0.0610541 -0.1600148 -0.029476 0.0520682 -0.0245746 0.104082 0.0033202 0.0297432 0.0079133 0.0834821 0.1110818 0.0100249 0.0137119 0.0189493 -0.0225838 -0.1184118 0.0233434 -0.133267 -0.0026243 0.114538 0.0175811 -0.0061488 0.0127939 -0.0215669 0.1129216 0.0017069 0.1190489 0.026924 0.103724 0.0388178 0.0185823 0.0414111 -0.1163634 -0.0880647 0.0080291 -0.0562335 0.0621041 -0.1058916 -0.0452024 0.0932719 -0.0644999 0.10618 0.020225 0.1076491 0.0195649 0.0625448 0.023855 0.0182226 -0.1263252 0.0362213 0.1092754 0.0160265 -0.1461285 0.0081863 -0.0614648 0.0800539 0.0031748 0.0032972 -0.0030129 -0.0349059 -0.0793553 -0.0294409 -0.0619769 0.0520854 0.0511329 -0.0056448 0.012738 0.0125187 0.014865 0.1026601 -0.02027 0.0807224 -0.0174651 -0.0254771 0.0052601 -0.0081946 0.1044912 -0.1008975 0.0157083 0.0489645 0.0022541 0.1019508 -0.0120518 -0.0096853 -0.0199937 -0.0044961 0.0523363 0.0779339 0.0905085 0.109582 -0.0594659 -0.0067536 -0.0488696 -0.0564517 -0.0761742 0.0593744 -0.0824464 -0.0986825 -0.0871349 -0.0019253 unknown
polarizability: 130.3649754|5.7319418|111.8777453|2.1323412|-1.1079711|101.7689308 unknown
InChI: InChI=1S/C7H15ClO2Si/c1-10-7(9)4-5-11(2,3)6-8/h4-6H2,1-3H3
charge 0 multiplicity 1
26 atoms
Cl 2.170076 -2.617139 -0.14796
Si 2.110778 0.523445 -0.006416
O  -3.079676 -0.399519 -0.685442
O  -2.522535 0.835975 1.208667
C  0.325656 0.380892 0.681124
C  2.487921 -1.008644 -1.117148
C  3.367386 0.573326 1.428375
C  2.287198 2.065514 -1.132875
C  -0.756351 0.134727 -0.392677
C  -2.171285 0.245092 0.163004
C  -4.50404 -0.32618 -0.276424
H  0.082948 1.302914 1.244423
H  0.303499 -0.442892 1.42011
H  1.842039 -1.074604 -2.008196
H  3.5436 -1.063265 -1.430181
H  4.40034 0.693647 1.053609
H  3.153521 1.414549 2.11291
H  3.321752 -0.363688 2.01203
H  2.069385 2.985967 -0.559985
H  3.31429 2.153727 -1.532332
H  1.591959 2.029968 -1.991796
H  -0.646452 -0.859553 -0.861651
H  -0.682339 0.877006 -1.214574
H  -4.835248 0.724925 -0.226552
H  -4.641071 -0.794628 0.712632
H  -5.048352 -0.877662 -1.055676
