program: Gaussian 09
title: 000252795
version: EM64L-G09RevD.01
frameworkgroup: C1[X(C22H15Br)]
method: RPBEPBE
basis: SDD
operation: Freq
keyword: #p
keyword: freq=noraman
keyword: PBEPBE/SDD
title: #p freq=noraman PBEPBE/SDD
converged: YES YES NO NO
title: Mulliken charges:
elementType: Br C C C C C C C C C C C C C C C C C C C C C C H H H H H H H H H H H H H H H
charge: -0.002451 0.148365 0.133560 0.034091 0.132077 0.353773 -0.402037 -0.416026 -0.375002 -0.346745 -0.357241 -0.240847 -0.237442 -0.253835 -0.275055 -0.173520 -0.303192 0.566926 -0.389912 -0.386234 -0.201252 -0.245579 -0.237222 0.245631 0.248212 0.239335 0.218647 0.227561 0.228080 0.228682 0.227392 0.225937 0.207544 0.228167 0.225446 0.251858 0.233257 0.239050
chargesum: 0.00000
title: Mulliken charges with hydrogens summed into heavy atoms:
elementType: Br C C C C C C C C C C C C C C C C C C C C C C
charge: -0.002451 0.148365 0.133560 0.034091 0.132077 0.353773 -0.156407 -0.167814 -0.135667 -0.128099 -0.129680 -0.012767 -0.008760 -0.026443 -0.049117 0.034024 -0.075025 0.566926 -0.389912 -0.160788 0.050606 -0.012322 0.001828
polarizability: 5.94883903e+02 3.80539558e+01 3.46893083e+02 1.64880908e+00 -4.46613888e-01 9.21914260e+01
1716.lowfreq: -3.6679 -0.9934 -0.0008 -0.0004 -0.0001 2.1953 6.7217 29.0037 34.8787
frequency: 6.4417 28.9979 34.8562 73.2684 94.3152 100.4384 131.1568 137.2891 143.3766 151.4153 220.2182 220.5026 265.8402 283.4107 298.6877 329.6866 352.4436 404.1519 417.1116 431.6901 443.7584 466.2655 488.7174 512.0450 532.1818 546.6041 566.8889 614.4864 619.2162 639.8469 650.8715 658.0439 717.2042 722.9532 736.6458 752.8754 759.9048 770.1029 787.3849 796.6394 844.6706 857.1596 868.6809 877.3417 886.6865 901.7049 913.8882 943.4452 948.3700 949.0862 979.4317 982.1517 984.5094 989.7794 993.5603 997.8622 1023.6846 1032.6205 1042.8264 1075.8708 1110.1469 1112.1990 1136.2911 1169.4708 1172.0551 1176.0507 1196.3189 1206.6684 1227.2369 1250.0794 1262.4425 1284.3817 1301.3698 1309.9937 1315.1440 1352.7223 1374.3263 1389.4415 1402.6595 1424.4374 1437.1469 1443.8119 1452.7511 1466.9218 1478.2193 1556.8931 1581.6123 1584.8962 1588.1819 1601.2412 1609.4807 1611.1581 1631.1404 3082.9332 3116.8634 3121.4952 3125.4290 3128.9369 3135.7031 3137.2344 3142.6557 3148.1739 3151.9002 3159.2478 3162.3251 3162.7980 3173.9217 3176.8097
redmass: 7.1269 4.7133 6.5612 4.1907 10.7013 4.2118 3.2524 3.8183 5.5219 2.8361 3.5077 4.9139 8.5804 4.0443 6.7665 3.8260 5.4813 3.0264 6.5007 3.6800 3.0032 3.2839 5.0999 5.5641 3.3384 6.1208 3.2318 6.7821 6.0962 3.5918 5.7983 6.9152 2.9023 5.4243 1.5660 1.4056 1.3363 5.7915 2.4370 2.3784 4.5128 1.3929 1.6332 1.4557 1.8438 6.1315 1.6182 1.4660 1.4259 1.3905 1.2388 1.3490 1.3326 1.2437 7.1446 7.0946 2.3119 1.9583 2.1247 3.1068 1.7942 1.8667 1.8329 1.1199 1.0985 1.1037 1.8715 2.0182 1.7810 1.9256 1.5789 1.7698 1.7990 1.6695 1.5056 2.5878 5.3754 2.3774 3.3965 2.3438 2.3137 2.8552 2.5418 2.7400 4.0524 5.4177 6.2844 5.8670 6.4507 5.4173 7.1792 7.3047 6.8271 1.0878 1.0894 1.0857 1.0856 1.0889 1.0855 1.0901 1.0942 1.0904 1.0923 1.0939 1.1000 1.0950 1.0935 1.0999
irintensity: 0.2201 0.1450 0.3964 0.3379 0.1537 1.6625 0.1227 0.0009 0.1333 0.3367 3.9841 0.2480 1.8160 0.1447 1.5449 0.0820 4.4591 7.0018 0.0378 0.5774 6.9654 1.6756 8.6490 1.3508 0.5038 20.7278 0.0008 0.8167 3.8766 9.2064 5.8032 16.0218 6.1477 2.3529 81.2090 42.5551 74.3069 8.4784 10.0547 45.3037 1.0084 0.4312 0.9132 0.2213 0.0008 3.0673 0.0920 0.1073 0.8823 0.5181 45.4321 0.8806 0.5157 27.1783 2.1689 74.8450 2.7027 8.1557 5.9136 3.8550 7.4873 1.2411 1.6812 1.7929 0.0923 2.1700 2.5775 0.0025 2.0509 18.1949 19.6833 1.9815 6.4551 1.7257 0.5527 2.6581 10.1202 13.0188 2.7744 24.9320 33.7911 94.9095 15.9894 2.1045 54.7230 12.5940 0.6446 7.2765 2.4872 7.4890 9.0263 9.5433 30.4735 8.6513 14.0222 4.8998 2.5830 1.1084 8.2989 6.8779 21.2870 3.1332 23.1978 35.2707 52.4258 13.6626 28.9735 30.1312
temp: 298.150 k
press: 1.00000 atm
elementType: 35 6 6 6 6 6 6 6 6 6 6 6 6 6 6 6 6 6 6 6 6 6 6 1 1 1 1 1 1 1 1 1 1 1 1 1 1 1
symmnumber: 1
zpe: 767671.1 jmol-1
zpe.correction: 0.292390 hartree
zpe.thermalcorrener: 0.311042 hartree
zpe.thermalcorrenthalpy: 0.311986 hartree
zpe.thermalcorrgfe: 0.241889 hartree
zpe.sumelectzpe: -859.264207 hartree
zpe.sumelectthermal: -859.245556 hartree
zpe.sumelectthermalent: -859.244612 hartree
zpe.sumelectthermalfe: -859.314709 hartree
dipole: 0.2882 1.9149 0.1014
dipole: 1.9391
quadrupole: -122.8338 -122.3702 -154.2053
quadrupole: 9.0049 0.4055 -0.0758
quadrupole: 10.3026 10.7662 -21.0689 9.0049 0.4055 -0.0758
hfenergy: -859.556598 hartree
pointgroup: C01 [X(C22H15Br1)]
dipole: 0.3126052 -0.690957 0.0828754 debye
polarizability: 596.4850656|32.8449898|338.0800023|4.1619499|-41.5764012|99.4033438 unknown
InChI: InChI=1S/C22H15Br/c23-22-15-6-1-8-16(22)9-7-14-21-19-12-4-2-10-17(19)18-11-3-5-13-20(18)21/h1-15H
charge 0 multiplicity 1
38 atoms
Br 4.543531 3.605602 -0.298146
C  -3.658271 0.003853 0.029304
C  -3.057266 -1.314586 0.300704
C  -2.594273 0.949481 -0.126523
C  -1.62445 -1.172047 0.309059
C  -1.291207 0.253508 0.038574
C  -5.003693 0.405397 -0.083294
C  -3.667847 -2.5620 0.530381
C  -2.885266 2.303383 -0.39699
C  -0.822986 -2.31011 0.556844
C  -0.074055 0.90866 -0.063588
C  -5.288311 1.765787 -0.354233
C  -2.850809 -3.691489 0.774309
C  -4.237419 2.706108 -0.509479
C  -1.440131 -3.563266 0.787636
C  1.260048 0.373671 0.054585
C  2.379928 1.173084 -0.064766
C  3.777392 0.746667 0.025705
C  4.864422 1.671517 -0.059658
C  4.142179 -0.627744 0.199536
C  6.212491 1.271917 0.022442
C  5.480609 -1.044598 0.283812
C  6.526092 -0.094202 0.195593
H  -5.820533 -0.315146 0.034899
H  -4.758857 -2.662309 0.522223
H  -2.086678 3.043628 -0.520836
H  0.268013 -2.253438 0.579692
H  -0.118222 1.98919 -0.267111
H  -6.328529 2.097679 -0.44542
H  -3.309539 -4.669922 0.955143
H  -4.476459 3.754593 -0.718945
H  -0.817801 -4.444243 0.979736
H  1.37662 -0.697528 0.243015
H  2.21718 2.243989 -0.243238
H  3.347001 -1.377451 0.26281
H  7.008909 2.017893 -0.047752
H  5.713332 -2.106458 0.415601
H  7.573553 -0.406274 0.258776
