program: Gaussian 09
title: 000252793
version: EM64L-G09RevD.01
frameworkgroup: C1[X(C8H8ClNO2)]
method: RPBEPBE
basis: SDD
operation: Freq
keyword: #p
keyword: freq=noraman
keyword: PBEPBE/SDD
title: #p freq=noraman PBEPBE/SDD
converged: NO YES NO YES
title: Mulliken charges:
elementType: Cl O O N C C C C C C C C H H H H H H H H
charge: -0.024488 -0.210666 -0.203088 0.018300 0.399398 0.222047 0.588711 -0.565653 -0.360823 -0.325901 -0.768158 -0.792866 0.295461 0.266772 0.215852 0.256254 0.256261 0.249272 0.249288 0.234028
chargesum: 0.00000
title: Mulliken charges with hydrogens summed into heavy atoms:
elementType: Cl O O N C C C C C C C C
charge: -0.024488 -0.210666 -0.203088 0.018300 0.399398 0.222047 0.588711 -0.270192 -0.094051 -0.325901 -0.039792 -0.060278
polarizability: 1.71625171e+02 -1.85896309e+00 1.26713887e+02 -1.06033426e-02 9.09115041e-03 5.17234288e+01
1716.lowfreq: -8.3864 -3.4337 -0.0014 0.0019 0.0025 3.2399 22.0294 72.7981 116.9919
frequency: 21.6789 72.7961 116.9533 147.7263 194.4329 211.4410 226.6601 236.9283 297.7703 313.6158 336.0570 393.1517 443.3419 462.3832 502.5460 558.1430 567.7681 679.5312 685.5527 722.8643 740.7844 778.6705 874.8092 925.7440 943.6116 995.6155 1024.0176 1038.6535 1052.4361 1074.4507 1191.7664 1201.2704 1235.5581 1261.2084 1328.5494 1367.1648 1398.5410 1405.4527 1406.6321 1451.8914 1458.6377 1463.0559 1474.3101 1482.1349 1553.6189 1617.7935 2990.7322 2998.4558 3070.0976 3085.8361 3099.5294 3104.7439 3162.3796 3173.8189
redmass: 8.5587 6.8052 1.0990 2.8479 11.4927 1.2382 2.6929 3.9188 10.7035 3.5451 4.5531 6.1630 3.0664 5.1009 6.9249 4.0776 5.0360 4.6365 7.6616 5.3262 7.4993 5.4016 1.3337 1.3592 7.2943 1.4902 1.3649 1.5357 1.5220 3.3360 2.1100 9.3126 7.1134 1.2352 5.0183 5.9119 4.6556 1.2267 1.3665 1.0459 1.1643 1.0438 1.1146 3.5051 5.5220 8.0603 1.0373 1.0364 1.0973 1.0962 1.1015 1.0997 1.0924 1.0916
irintensity: 0.0014 4.0579 0.6550 0.3817 4.0476 1.1625 0.1421 0.6783 2.5288 1.7212 1.2486 0.4639 6.6330 1.9200 12.4645 0.8811 4.4857 3.6303 0.3667 2.5524 30.4988 0.2120 8.4336 16.9901 71.2742 4.1293 17.6870 4.9374 15.9296 12.3124 90.9160 242.4829 26.6876 0.9168 31.6256 120.0613 7.3584 3.5046 29.4943 12.9595 11.7144 16.4912 27.8614 62.1689 68.8822 20.0545 13.9430 11.2504 11.0535 6.2037 23.3286 11.9562 1.5266 4.3676
temp: 298.150 k
press: 1.00000 atm
elementType: 17 8 8 7 6 6 6 6 6 6 6 6 1 1 1 1 1 1 1 1
symmnumber: 1
zpe: 380551.9 jmol-1
zpe.correction: 0.144945 hartree
zpe.thermalcorrener: 0.156554 hartree
zpe.thermalcorrenthalpy: 0.157498 hartree
zpe.thermalcorrgfe: 0.106132 hartree
zpe.sumelectzpe: -973.957767 hartree
zpe.sumelectthermal: -973.946157 hartree
zpe.sumelectthermalent: -973.945213 hartree
zpe.sumelectthermalfe: -973.996580 hartree
dipole: -3.3981 -0.9811 0.0000
dipole: 3.5369
quadrupole: -93.8275 -70.2851 -76.9737
quadrupole: -8.3666 -0.0009 0.0002
quadrupole: -13.4654 10.0770 3.3884 -8.3666 -0.0009 0.0002
hfenergy: -974.1027113 hartree
pointgroup: C01 [X(C8H8Cl1N1O2)]
dipole: 1.3159891 -0.4522333 0.0000117 debye
dipolederiv: -0.8636755 0.1644141 0.0000678 0.211645 -0.1558164 -0.0000112 0.0000818 -0.0000245 -0.052199 -0.6075296 0.1843441 0.0000004 0.2613327 -0.8459206 0.0000568 -0.0000655 0.0002406 -0.2342546 -0.8565387 -0.1573694 0.0001507 -0.1940127 -0.5521296 0.0001593 0.0000007 0.0000285 -0.2143896 1.773677 -0.2324777 -0.0001471 -0.2616169 1.2117253 -0.0002447 -0.0000669 -0.0002515 0.182956 0.3488282 0.2831843 -0.0000393 -0.1842737 0.2511671 -0.0000039 0.0000296 -0.0000775 0.0084481 -0.7263325 0.2305985 0.0000117 0.1629465 -0.0960079 0.0000352 0.0000931 -0.0000055 0.0362002 -0.201023 0.4808294 -0.0000405 0.45914 -0.0317871 -0.0000664 -0.0001411 -0.000187 0.0147174 0.2121591 -0.3021156 0.0000041 0.1866815 -0.1481816 -0.0000201 -0.0000101 0.0000082 -0.1195593 -0.5633777 -0.1993929 0.0000502 -0.0895982 -0.0550877 -0.0000071 0.0000508 0.0000297 -0.1056911 1.271914 -0.2821225 -0.000143 -0.4136237 0.3277796 0.0000134 -0.0001271 0.0000408 -0.0724571 -0.0701164 -0.2808577 0.0000086 -0.0996828 -0.0035253 0.0000374 0.0000205 0.0000805 0.0231661 -0.1170098 -0.1550855 0.0000437 -0.104214 0.0195645 0.0000502 0.0001753 0.0002482 0.0463164 0.1280977 0.0274576 -0.0000046 -0.012557 0.0391687 -0.0000019 0.0000107 -0.0000003 0.1629199 0.0765563 0.0179406 -0.0000006 0.0327575 -0.0315154 0.0000031 -0.0000096 -0.0000076 0.1524156 0.0268993 0.1737789 0.0000398 0.0426579 -0.0997389 -0.0000346 0.000019 -0.0000552 0.1065771 0.0384114 -0.0091605 0.0824273 0.0031987 0.0605333 -0.0296243 0.0795822 0.0005309 -0.0049205 0.0383418 -0.0091285 -0.0824521 0.0032539 0.0605503 0.0296501 -0.0796031 -0.0005014 -0.0048153 0.0238857 -0.0372867 -0.0907178 -0.0154772 0.0609194 0.0436408 -0.1007234 -0.0095259 -0.0199273 0.0241138 -0.0374073 0.0906152 -0.0157291 0.0608987 -0.0434865 0.1006525 0.0096117 -0.020307 0.0427188 0.1398569 0.0001258 0.0271714 -0.0725964 -0.0001454 0.0000308 -0.0001827 0.1148038 unknown
polarizability: 171.6986399|-0.388299|126.6404179|-0.0110437|-0.0085508|51.7234288 unknown
InChI: InChI=1S/C8H8ClNO2/c1-5-4-8(10(11)12)6(2)3-7(5)9/h3-4H,1-2H3
charge 0 multiplicity 1
20 atoms
Cl 3.625167 -0.908247 -0.000485
O  -2.488864 1.895931 -0.000453
O  -3.190816 -0.266502 0.000127
N  -2.253219 0.623683 0.000042
C  -0.479081 -1.2055 -0.000073
C  -0.834813 0.176453 -0.000079
C  1.514699 0.931958 -0.000343
C  0.132717 1.209333 -0.000222
C  0.913577 -1.476581 -0.00019
C  1.865331 -0.44239 -0.000308
C  -1.44058 -2.377211 0.000043
C  2.544249 2.040281 -0.000566
H  -0.22026 2.244104 -0.000255
H  1.252914 -2.516482 -0.000193
H  -0.877624 -3.325624 -0.000222
H  -2.106873 -2.355131 0.879121
H  -2.107359 -2.354937 -0.878662
H  3.201643 1.97416 0.885365
H  3.200173 1.975106 -0.887672
H  2.057315 3.028696 0.000333
