program: Gaussian 09
title: 000260881
version: EM64L-G09RevD.01
frameworkgroup: C1[X(C7H16OSi)]
method: RPBEPBE
basis: SDD
operation: Freq
keyword: #p
keyword: freq=noraman
keyword: PBEPBE/SDD
title: #p freq=noraman PBEPBE/SDD
converged: YES YES NO NO
title: Mulliken charges:
elementType: Si O C C C C C C C H H H H H H H H H H H H H H H H
charge: 1.399198 -0.596123 -1.056989 -1.032276 -1.037966 -0.038344 -0.696515 -0.024312 -0.603724 0.247839 0.239056 0.241886 0.244706 0.225562 0.250778 0.230123 0.250771 0.242414 0.185623 0.231078 0.221100 0.209616 0.231357 0.219338 0.215804
chargesum: 0.00000
title: Mulliken charges with hydrogens summed into heavy atoms:
elementType: Si O C C C C C C C
charge: 1.399198 -0.596123 -0.328208 -0.311231 -0.314657 0.147279 -0.034721 0.207045 -0.168582
polarizability: 1.08251969e+02 7.33307873e+00 1.06902908e+02 -2.87958134e+00 -2.75608940e+00 9.29659563e+01
1716.lowfreq: -19.7414 -7.3219 0.0028 0.0029 0.0030 7.1216 31.6166 65.3388 81.8561
frequency: 31.0330 65.1342 81.8262 106.9461 124.0360 143.0329 154.1494 174.2195 189.9257 203.3058 220.9800 236.6018 264.9467 302.0594 326.7789 370.2218 470.1199 582.1431 658.4922 690.1572 696.8435 703.9761 741.0801 802.6374 814.5017 837.0095 909.8267 911.8726 921.2788 947.8185 950.7207 976.2407 1009.9981 1060.7792 1116.9147 1179.0472 1271.5677 1291.5861 1296.2293 1303.1188 1307.4200 1309.2657 1379.0121 1426.6184 1435.4736 1446.0600 1446.9490 1448.6287 1450.8210 1457.1649 1463.9953 1472.9450 1648.8394 2938.7367 2981.3758 2982.6368 2988.1455 2988.5774 3079.3896 3081.5504 3083.5832 3090.5460 3091.1151 3091.4642 3095.1087 3096.4484 3096.8620 3097.6111 3190.9171
redmass: 3.0246 3.4264 2.9775 1.0208 2.7564 1.0627 1.0291 2.5086 2.4498 2.4134 1.0666 2.6175 3.1016 2.1879 2.5081 2.7844 4.1783 3.6820 2.7024 2.6958 2.1053 2.7998 1.1708 1.3976 1.4187 1.8572 1.5731 1.5442 1.5580 1.6629 1.7053 1.4216 1.1521 2.6713 2.3610 2.1720 1.2928 1.2082 1.2000 1.2582 1.2425 1.1940 1.2290 1.1955 1.0543 1.0520 1.0542 1.0492 1.0489 1.0515 1.0469 1.0507 4.6301 1.0847 1.0345 1.0343 1.0345 1.0346 1.0636 1.0961 1.0969 1.0985 1.0975 1.0978 1.0955 1.0990 1.0987 1.0982 1.1138
irintensity: 0.0612 2.2868 0.2769 0.0192 0.1793 0.0054 0.0153 0.4821 0.2905 1.5453 0.2096 5.4148 7.3866 3.3565 7.2071 10.8496 6.0396 0.0755 29.9390 13.2553 0.6844 9.8300 0.1073 19.7329 19.6365 4.8750 104.4851 99.7771 103.7661 278.3262 15.5840 83.4903 5.2789 153.4019 7.9715 8.0544 0.2827 58.3551 52.4783 1.9007 10.9955 28.9091 21.2086 15.2445 0.3971 4.0040 0.4862 5.4517 8.9203 10.8107 20.6755 4.3782 5.3627 40.0005 15.1248 10.1109 16.5284 19.1691 9.5542 7.8654 20.5990 14.0179 26.0564 21.1597 12.9752 8.8812 33.7356 23.9161 26.0015
temp: 298.150 k
press: 1.00000 atm
elementType: 14 8 6 6 6 6 6 6 6 1 1 1 1 1 1 1 1 1 1 1 1 1 1 1 1
symmnumber: 1
zpe: 555105.6 jmol-1
zpe.correction: 0.211429 hartree
zpe.thermalcorrener: 0.225522 hartree
zpe.thermalcorrenthalpy: 0.226466 hartree
zpe.thermalcorrgfe: 0.170861 hartree
zpe.sumelectzpe: -640.228887 hartree
zpe.sumelectthermal: -640.214794 hartree
zpe.sumelectthermalent: -640.213849 hartree
zpe.sumelectthermalfe: -640.269455 hartree
dipole: 0.0891 -1.1678 0.6125
dipole: 1.3217
quadrupole: -62.8338 -66.1760 -63.4691
quadrupole: -0.0813 -0.0734 0.7375
quadrupole: 1.3258 -2.0163 0.6905 -0.0813 -0.0734 0.7375
hfenergy: -640.4403155 hartree
pointgroup: C01 [X(C7H16O1Si1)]
dipole: 0.1394323 0.1730249 0.4701351 debye
dipolederiv: 1.8971157 -0.2468858 -0.2091631 -0.1292931 1.4694988 0.0136318 0.1814326 -0.1208388 1.2982175 -1.5620329 0.4132137 0.0612805 0.4093102 -0.7695376 0.0532351 -0.0207065 0.0506196 -0.668322 -0.3990231 -0.0256049 0.0110707 -0.066843 -0.4641255 -0.1080145 -0.0700155 -0.0763794 -0.3587387 -0.3816163 0.0319846 0.1276959 0.0344182 -0.3316271 -0.0417517 0.1172226 -0.0447527 -0.4042896 -0.3651444 0.0066171 0.087391 0.0080499 -0.4601955 0.1015496 -0.0016069 0.1181247 -0.3898687 0.9194831 -0.2700985 -0.003658 -0.347876 0.4871256 -0.1044388 -0.1919025 0.0854936 0.3511186 -0.0935524 0.0358867 -0.0085314 0.0382181 0.0616212 0.0560698 -0.0789202 0.0286556 -0.1109553 -0.2438101 0.1334306 -0.0974863 0.157703 0.0599584 0.0408528 -0.0677671 0.0415349 0.0562772 -0.3380087 0.1810149 -0.0744933 0.179561 0.0226274 -0.0298383 -0.0812119 -0.0147519 -0.1611362 0.0534128 0.0530297 0.1043956 0.0744591 0.0629719 -0.0709524 0.1325481 -0.0486431 -0.0335296 -0.1140288 0.0193628 -0.0984244 -0.0067759 0.1290284 0.0172511 -0.1184069 0.0235281 0.0631346 0.1101767 -0.0230079 0.0181006 -0.0219423 -0.089795 0.1166769 0.0217945 0.0921957 0.0427719 0.0986241 -0.0536363 0.0400087 -0.042953 -0.0098531 0.1134824 0.0398808 0.1297515 -0.0084953 -0.1243481 0.0807117 -0.0583264 0.0789049 0.0780925 0.0203477 -0.0588887 0.018826 0.0863753 0.106987 -0.0430507 -0.0405858 -0.0564309 -0.0291845 -0.103302 -0.0456225 -0.1157093 0.0232955 -0.0766136 0.0851339 -0.0950174 0.1064809 0.0615644 0.0320094 -0.1189398 0.0445014 0.0592391 0.0266586 0.0035602 0.1139896 -0.0159677 0.1182204 -0.0171611 0.1385442 -0.0546181 -0.0531841 0.0735049 -0.0858914 -0.0406137 -0.0833406 -0.0756419 -0.0788122 -0.0214331 -0.065108 0.0761102 -0.0469955 -0.0515541 -0.0216506 -0.0110184 -0.1824068 -0.0223828 0.0149188 -0.1029342 -0.0069148 0.0616215 -0.0580825 0.0791278 -0.0502518 0.0660277 0.0731748 0.0590851 0.0720476 -0.1059975 0.0651472 -0.0538793 -0.0270459 -0.108255 -0.1015163 -0.0707972 -0.0314825 -0.0067235 0.0799658 -0.0895132 0.121822 0.0105084 0.1331631 0.0034227 -0.0288748 0.0411232 -0.0508126 0.0755982 0.1361895 -0.0694024 0.0140111 -0.0955978 -0.0847577 0.0086576 0.0143933 -0.0487614 0.0468049 0.1470086 -0.075018 0.1015929 -0.086417 0.0597901 0.0623875 0.1185494 0.0400362 -0.0443692 0.1387572 -0.1096558 0.0058234 -0.0973057 -0.0813085 -0.0330005 0.0274115 0.0047179 0.0868922 unknown
polarizability: 104.1515715|-6.0411921|95.40463|-6.4788099|4.2366954|108.5646315 unknown
InChI: InChI=1S/C7H16OSi/c1-6-7(2)8-9(3,4)5/h6-7H,1H2,2-5H3
charge 0 multiplicity 1
25 atoms
Si 1.397423 -0.549879 -0.099721
O  -0.0944 -0.203889 -0.96924
C  1.975386 1.007779 0.844333
C  2.593714 -1.026757 -1.496446
C  1.141594 -2.004329 1.108882
C  -1.209218 0.625136 -0.479614
C  -2.202446 0.736417 -1.648198
C  -1.847172 0.004792 0.750817
C  -2.003183 0.636461 1.941462
H  1.264543 1.27329 1.64791
H  2.962152 0.832483 1.31271
H  2.072947 1.874004 0.164759
H  2.762455 -0.172311 -2.175482
H  3.571838 -1.353007 -1.09758
H  2.171688 -1.85458 -2.093892
H  2.101733 -2.311916 1.564637
H  0.447618 -1.723867 1.920907
H  0.719083 -2.878037 0.58039
H  -0.831847 1.638736 -0.217618
H  -1.688093 1.149085 -2.533305
H  -2.592264 -0.262679 -1.911641
H  -3.050914 1.392274 -1.382517
H  -2.194074 -1.031874 0.618799
H  -2.485382 0.148699 2.796095
H  -1.662879 1.66967 2.091756
