program: Gaussian 09
title: 000252789
version: EM64L-G09RevD.01
frameworkgroup: C1[X(C14H5Cl7O3)]
method: RPBEPBE
basis: SDD
operation: Freq
keyword: #p
keyword: freq=noraman
keyword: PBEPBE/SDD
title: #p freq=noraman PBEPBE/SDD
converged: YES YES NO NO
title: Mulliken charges:
elementType: Cl Cl Cl Cl Cl Cl Cl O O O C C C C C C C C C C C C C C H H H H H
charge: 0.048574 0.064441 0.071806 0.070987 0.077114 -0.009084 -0.045298 -0.290492 -0.226816 -0.140840 0.745865 -0.293202 -0.305807 -0.429194 0.529954 -0.088933 -0.093757 -0.119107 0.232255 -0.301951 -0.298869 -0.191993 -0.229081 -0.111732 0.291999 0.254570 0.245803 0.283293 0.259493
chargesum: 0.00000
title: Mulliken charges with hydrogens summed into heavy atoms:
elementType: Cl Cl Cl Cl Cl Cl Cl O O O C C C C C C C C C C C C C C
charge: 0.048574 0.064441 0.071806 0.070987 0.077114 -0.009084 -0.045298 -0.290492 -0.226816 -0.140840 0.745865 -0.293202 -0.305807 0.117375 0.529954 -0.088933 -0.093757 -0.119107 0.232255 -0.301951 -0.053066 0.091300 0.030412 -0.111732
polarizability: 2.99082738e+02 -1.23689465e+01 2.81518876e+02 -7.89385167e+00 2.22136078e+00 1.20600591e+02
1716.lowfreq: -3.9259 -2.3496 -0.0033 -0.0029 -0.0020 2.8884 9.2531 12.0762 18.0776
frequency: 8.8354 12.0261 18.0142 20.6263 41.2522 65.1472 68.6368 75.9573 93.0428 119.2357 131.0170 164.8000 181.8163 185.3799 191.6957 200.4279 201.0132 213.2200 228.4342 245.0799 292.1217 314.6961 317.7891 322.0724 335.6742 344.1042 356.7168 360.6797 363.6853 388.0554 439.3302 479.9597 517.8584 549.1936 560.3033 592.0035 592.4550 612.1636 618.5417 664.6039 680.5895 684.3938 701.3767 719.1625 777.2692 794.5115 798.5394 823.9603 831.5674 864.7480 921.9784 925.1549 996.8416 1008.9346 1022.5994 1057.5996 1071.4234 1088.0731 1154.6588 1216.8498 1228.3096 1245.2324 1259.8513 1329.0446 1338.4406 1344.1187 1355.8729 1364.9658 1386.7892 1444.0719 1462.4767 1537.1617 1544.5999 1575.2381 1594.9433 1718.9791 3002.1957 3086.5997 3154.6708 3180.0032 3182.8543
redmass: 19.3210 15.0406 16.1947 15.2756 13.7482 16.8383 16.1988 22.0848 13.9531 11.5277 14.4236 5.9163 15.5108 10.8674 9.5912 25.7817 28.0000 34.7220 9.6928 5.5632 15.3306 19.3986 12.5469 14.6696 8.9252 13.3712 12.0611 22.0984 6.9711 9.6697 3.2333 8.1279 3.4002 4.1378 8.1506 10.6092 9.8952 12.8796 7.6963 13.9460 7.0600 9.4111 3.7145 12.8897 10.2070 1.8226 3.8695 12.8666 9.6637 1.3953 10.9508 1.3576 2.4989 5.9974 4.6977 5.5676 6.4719 2.5503 1.2993 1.8703 12.2548 1.4211 1.5113 12.0052 12.0007 1.4209 8.4157 4.7546 5.3887 1.0825 2.6301 11.9971 11.9807 7.5465 7.9248 11.2608 1.0634 1.0978 1.0886 1.0957 1.0941
irintensity: 0.0933 0.0321 0.1267 0.0474 0.1955 0.5668 0.6122 0.0708 0.2857 1.4275 0.4261 0.1979 1.1058 2.3967 1.6139 0.0595 0.3774 0.0016 1.6975 3.3514 0.3816 1.0364 0.1308 4.9462 5.8700 2.6096 4.1317 3.2647 0.8139 2.1154 8.0645 8.0900 0.0488 6.5717 0.8214 2.3687 3.4157 15.1505 33.7724 62.6393 37.3228 9.3141 1.4106 36.0311 23.3834 46.0624 37.6783 0.4220 98.6130 20.5587 16.6766 0.2398 138.2882 251.2745 516.6546 5.1992 7.4263 33.6152 4.3596 66.2089 3.0844 17.2549 81.4161 130.1417 29.8860 64.7868 226.7861 15.0848 2.1492 37.6258 224.8420 0.8980 2.9455 28.5826 3.5008 148.3831 25.3723 4.5646 6.4769 0.5097 1.3965
temp: 298.150 k
press: 1.00000 atm
elementType: 17 17 17 17 17 17 17 8 8 8 6 6 6 6 6 6 6 6 6 6 6 6 6 6 1 1 1 1 1
symmnumber: 1
zpe: 406516.9 jmol-1
zpe.correction: 0.154834 hartree
zpe.thermalcorrener: 0.178655 hartree
zpe.thermalcorrenthalpy: 0.179600 hartree
zpe.thermalcorrgfe: 0.094778 hartree
zpe.sumelectzpe: -3980.822357 hartree
zpe.sumelectthermal: -3980.798536 hartree
zpe.sumelectthermalent: -3980.797592 hartree
zpe.sumelectthermalfe: -3980.882414 hartree
dipole: 2.0355 0.3179 2.8741
dipole: 3.5362
quadrupole: -195.5025 -185.8324 -184.8614
quadrupole: -0.9195 -3.7447 -1.7539
quadrupole: -6.7704 2.8997 3.8707 -0.9195 -3.7447 -1.7539
hfenergy: -3980.9771915 hartree
pointgroup: C01 [X(C14H5Cl7O3)]
dipole: 0.7748676 -0.6723762 0.9397093 debye
polarizability: 300.8806541|-3.9843961|199.9281638|-11.7345111|79.7597767|200.3933863 unknown
InChI: InChI=1S/C14H5Cl7O3/c15-5-1-2-7(6(16)3-5)23-4-8(22)24-14-12(20)10(18)9(17)11(19)13(14)21/h1-3H,4H2
charge 0 multiplicity 1
29 atoms
Cl 0.763932 0.772501 2.469195
Cl 2.844287 -2.171528 -1.699121
Cl 5.577123 -0.429335 -1.604824
Cl 3.469256 2.551581 2.602998
Cl 5.874247 1.935309 0.556031
Cl -5.008129 -1.568292 -2.57293
Cl -6.475043 2.382383 1.041064
O  0.852922 -1.394078 0.405294
O  -2.563986 -1.770777 -0.934198
O  -0.26445 -0.012506 -1.148617
C  2.00373 -0.578275 0.396881
C  2.131288 0.461326 1.342525
C  3.054942 -0.847061 -0.505523
C  -1.339706 -2.071449 -0.223021
C  -3.413763 -0.780841 -0.413598
C  4.240823 -0.080882 -0.459806
C  3.312057 1.233614 1.395905
C  4.36912 0.960133 0.492817
C  -0.258221 -1.01012 -0.42627
C  -4.636074 -0.578322 -1.104723
C  -3.142203 -0.000143 0.735353
C  -5.570839 0.378185 -0.672426
C  -4.071631 0.964094 1.184483
C  -5.272007 1.139574 0.475165
H  -0.976264 -3.019436 -0.654166
H  -1.50235 -2.22753 0.861035
H  -2.204487 -0.113193 1.287405
H  -6.505951 0.520823 -1.219468
H  -3.854126 1.569244 2.068442
