program: Gaussian 09
title: 000260883
version: EM64L-G09RevD.01
frameworkgroup: C1[X(C8H18N2O4Si)]
method: RPBEPBE
basis: SDD
operation: Freq
keyword: #p
keyword: freq=noraman
keyword: PBEPBE/SDD
title: #p freq=noraman PBEPBE/SDD
converged: YES YES NO NO
title: Mulliken charges:
elementType: Si O O O O N N C C C C C C C C H H H H H H H H H H H H H H H H H H
charge: 1.313852 -0.289624 -0.279502 -0.295570 -0.313039 -0.626941 -0.617858 -0.771282 -0.661666 -0.668017 -1.034675 -0.350251 -0.683269 0.278682 0.327799 0.237762 0.221195 0.240171 0.267239 0.237526 0.284827 0.242432 0.243593 0.236395 0.241580 0.192072 0.218007 0.201159 0.213235 0.322008 0.392713 0.339374 0.340070
chargesum: 0.00000
title: Mulliken charges with hydrogens summed into heavy atoms:
elementType: Si O O O O N N C C C C C C C C
charge: 1.313852 -0.289624 -0.279502 -0.295570 -0.313039 0.087780 0.061587 -0.312325 -0.154256 -0.145665 -0.312255 0.083401 -0.050867 0.278682 0.327799
polarizability: 1.39915070e+02 2.73069863e+00 1.39427945e+02 6.96606945e+00 1.16812258e+01 1.32945887e+02
1716.lowfreq: -12.5320 -1.2683 0.0012 0.0015 0.0018 11.2220 36.4228 40.6611 52.4189
frequency: 36.2767 40.5160 52.3610 55.2480 72.3600 78.8433 87.8887 94.2790 112.0741 124.7705 148.2031 149.4742 159.0522 194.1405 228.1670 231.5227 281.1747 287.5726 323.0143 324.4354 347.8386 467.4853 471.6774 492.5303 522.0464 534.8250 573.6156 599.3061 611.4398 662.4882 674.8200 695.6753 696.6263 701.7405 720.3599 730.2806 759.5241 776.2274 792.7653 824.1473 840.5945 866.8758 883.0058 903.5027 996.4694 1010.2604 1023.3465 1044.4363 1062.5501 1076.2783 1097.8180 1195.6871 1213.7515 1224.8510 1245.1841 1248.8338 1285.2884 1295.6990 1299.4924 1313.5910 1338.7551 1339.1434 1382.7543 1432.4069 1437.8439 1439.3723 1450.1300 1450.5803 1472.0344 1474.2224 1482.9672 1585.8240 1607.8690 1667.1980 1686.7314 2964.6196 2969.5070 2973.0825 2979.7473 3009.5941 3012.9329 3013.2311 3036.5401 3068.1536 3071.6466 3081.7781 3083.0788 3083.7637 3093.5681 3446.1478 3559.4911 3669.6515 3717.3133
redmass: 4.5911 6.0937 4.1081 1.7855 3.3712 3.9517 4.4555 3.2097 1.1800 6.8512 3.6393 4.5372 4.2610 2.6498 1.2611 3.0448 2.6949 2.7105 3.5275 3.7138 4.4687 3.3266 3.1281 1.1479 1.0944 1.1400 3.7631 5.3768 3.6587 2.9366 2.2309 2.6908 2.3212 3.3258 1.9029 2.1655 1.7776 2.5651 2.9512 1.6626 1.6690 1.6340 1.6629 2.0215 6.8653 6.6545 1.3079 2.5187 1.9599 2.1744 1.9625 1.1849 1.3930 1.3667 1.2056 1.2144 1.2703 1.1435 1.1633 2.8004 1.3771 3.0304 1.2126 1.1055 1.0808 1.0898 1.0536 1.0523 1.0446 1.0460 1.0827 1.2627 1.1921 5.3970 7.6904 1.0583 1.0367 1.0600 1.0344 1.0562 1.0972 1.0554 1.1014 1.1003 1.1002 1.1017 1.1012 1.0986 1.1062 1.0546 1.0446 1.0964 1.1058
irintensity: 0.5302 0.9631 2.1532 0.1401 0.4372 1.9008 6.3399 0.5130 0.5866 7.9084 6.6338 6.7906 8.7457 0.1618 0.0999 0.4402 21.1167 8.2803 7.6687 12.5600 12.4610 1.7663 3.4155 227.6145 75.2658 134.2252 5.9197 11.0526 24.4789 1.1609 6.4258 26.8505 14.8680 23.1253 169.0022 132.7761 32.8928 22.0276 34.2070 34.4128 2.3784 53.5312 73.1067 15.8263 94.5258 98.6305 12.6095 4.1512 13.1839 31.1769 22.1317 6.1646 9.1886 4.9072 7.5121 1.7647 60.2142 29.8092 23.6996 125.3871 0.6180 485.5070 8.7591 53.3342 1.5073 20.8814 3.4080 13.7037 7.6304 7.1659 14.2660 114.9378 81.7514 506.4080 217.0986 6.9077 36.6944 40.3555 15.0584 21.2090 0.6194 27.0355 12.3283 55.6647 54.7501 1.4522 22.0416 14.2593 5.3777 229.2991 71.0478 87.6396 50.2124
temp: 298.150 k
press: 1.00000 atm
elementType: 14 8 8 8 8 7 7 6 6 6 6 6 6 6 6 1 1 1 1 1 1 1 1 1 1 1 1 1 1 1 1 1 1
symmnumber: 1
zpe: 699492.3 jmol-1
zpe.correction: 0.266423 hartree
zpe.thermalcorrener: 0.286056 hartree
zpe.thermalcorrenthalpy: 0.287000 hartree
zpe.thermalcorrgfe: 0.217302 hartree
zpe.sumelectzpe: -1014.274805 hartree
zpe.sumelectthermal: -1014.255171 hartree
zpe.sumelectthermalent: -1014.254227 hartree
zpe.sumelectthermalfe: -1014.323925 hartree
dipole: 3.7104 -3.3719 1.6107
dipole: 5.2660
quadrupole: -94.9568 -99.4341 -90.0838
quadrupole: 5.3136 10.5364 5.6485
quadrupole: -0.1319 -4.6092 4.7411 5.3136 10.5364 5.6485
hfenergy: -1014.5412271 hartree
pointgroup: C01 [X(C8H18N2O4Si1)]
dipole: -1.4473572 -1.4176877 -0.4332297 debye
polarizability: 137.9770591|0.7448649|132.6622127|6.9500138|-11.7599105|141.6496304 unknown
InChI: InChI=1S/C8H18N2O4Si/c1-3-4-15(2,5-13-7(9)11)6-14-8(10)12/h3-6,9-10H2,1-2H3
charge 0 multiplicity 1
33 atoms
Si 0.481892 -0.945122 1.25129
O  0.698198 1.763109 0.967902
O  -2.207092 -0.988984 0.216162
O  2.59515 2.135151 -0.394408
O  -2.046671 1.107368 -0.862885
N  0.407505 2.717249 -1.064402
N  -3.187695 -0.705224 -1.806101
C  0.909767 -1.399472 -0.562347
C  1.387938 0.693976 1.744804
C  -1.406033 -0.48472 1.37641
C  0.91498 -2.359863 2.465229
C  2.42431 -1.60719 -0.834286
C  2.70567 -2.036983 -2.291727
C  1.351975 2.207519 -0.208791
C  -2.444045 -0.088512 -0.824397
H  0.523478 -0.601396 -1.228696
H  0.349574 -2.319723 -0.828493
H  1.258127 0.957645 2.808843
H  2.467662 0.701129 1.505463
H  -1.890885 -0.941653 2.256116
H  -1.503556 0.615424 1.420175
H  0.392767 -3.292215 2.180843
H  2.000429 -2.568641 2.468251
H  0.617655 -2.106936 3.499822
H  2.970496 -0.666606 -0.624926
H  2.831205 -2.375807 -0.145252
H  3.788698 -2.173683 -2.468497
H  2.19712 -2.990484 -2.531175
H  2.341229 -1.271317 -3.001967
H  0.725229 3.150397 -1.927171
H  -0.576322 2.454514 -0.933654
H  -3.480858 -1.673034 -1.697816
H  -3.451401 -0.170615 -2.628518
