program: Gaussian 09
title: 000252786
version: EM64L-G09RevD.01
frameworkgroup: C1[X(C13H7BrClNO)]
method: RPBEPBE
basis: SDD
operation: Freq
keyword: #p
keyword: freq=noraman
keyword: PBEPBE/SDD
title: #p freq=noraman PBEPBE/SDD
converged: NO YES NO NO
title: Mulliken charges:
elementType: Br Cl O N C C C C C C C C C C C C C H H H H H H H
charge: 0.014912 -0.046093 -0.154127 -0.691782 0.267304 0.308251 0.263704 0.221514 -0.311342 -0.354577 -0.621707 -0.365003 -0.408538 0.710363 -0.504415 -0.098922 -0.231908 0.261963 0.277772 0.270945 0.282815 0.262289 0.326381 0.320199
chargesum: 0.00000
title: Mulliken charges with hydrogens summed into heavy atoms:
elementType: Br Cl O N C C C C C C C C C C C C C
charge: 0.014912 -0.046093 -0.154127 -0.045202 0.267304 0.308251 0.263704 0.221514 -0.311342 -0.092614 -0.343934 -0.094058 -0.125723 0.710363 -0.504415 -0.098922 0.030381
polarizability: 3.29121706e+02 -1.33825241e+01 2.12236672e+02 6.93877886e-03 8.58062568e-03 6.20300833e+01
1716.lowfreq: -2.2051 -0.0022 -0.0017 -0.0012 4.2753 4.3863 56.1541 70.0061 85.5474
frequency: 56.1503 69.9997 85.5451 99.7572 177.9177 195.5936 210.2554 222.3364 249.6067 251.6329 278.1195 321.3061 350.2960 419.6128 424.1901 427.3462 440.4796 469.2207 469.8138 527.7384 574.8128 590.9578 599.2995 624.0729 668.1473 706.3662 725.6892 760.5022 763.3455 800.4932 847.8532 857.1291 884.1660 895.6842 914.1380 971.1021 973.4270 1012.8801 1046.8685 1058.2474 1088.3806 1120.9155 1185.8383 1206.7491 1249.4523 1263.4606 1305.2477 1361.6834 1388.3999 1405.6347 1444.0118 1466.7343 1489.3401 1576.7868 1584.9031 1599.6024 1621.7917 1632.0247 1644.6505 3136.6253 3152.1247 3155.7107 3161.1809 3176.9329 3544.0142 3690.0765
redmass: 7.2644 6.3477 20.0421 8.8026 5.3186 10.0159 5.2924 20.6308 5.6625 6.3538 11.1782 6.4908 4.9511 5.8618 1.2702 2.1960 2.9153 4.1974 1.2495 7.7193 6.2677 7.5013 7.0893 4.7675 7.9268 5.1665 6.7307 3.1965 6.6912 2.0613 1.8109 7.8559 1.4109 1.6442 1.9102 1.4389 3.7543 3.0021 1.6683 2.5716 2.5182 2.1104 2.4955 2.7643 1.2761 1.3355 4.3413 8.0829 3.4201 4.0459 2.8642 7.7408 4.9692 8.6467 7.8461 8.7423 2.8996 2.8061 2.7731 1.0922 1.0901 1.0928 1.0929 1.0962 1.0458 1.1034
irintensity: 1.4090 0.4030 0.0376 5.0030 0.0504 2.2395 0.8374 0.5525 7.5447 0.6525 0.1495 1.5457 3.9344 18.4913 95.4822 5.1579 0.2351 7.2531 204.0666 1.9687 3.8976 7.6047 12.7059 5.7592 11.6632 13.9520 4.8049 0.1060 16.1935 42.7901 3.3326 74.4331 25.0785 0.2260 40.9006 2.9403 105.0129 21.3573 13.7325 54.4292 17.2876 35.6412 26.1498 11.8635 10.2882 7.1053 28.5055 16.7914 44.2646 15.0427 32.8569 179.6110 153.1203 22.1920 213.0721 236.1102 143.7168 107.5403 206.8151 7.2826 2.2835 0.9041 1.1742 1.8418 144.7618 38.6993
temp: 298.150 k
press: 1.00000 atm
elementType: 35 17 8 7 6 6 6 6 6 6 6 6 6 6 6 6 6 1 1 1 1 1 1 1
symmnumber: 1
zpe: 428708.0 jmol-1
zpe.correction: 0.163286 hartree
zpe.thermalcorrener: 0.177369 hartree
zpe.thermalcorrenthalpy: 0.178313 hartree
zpe.thermalcorrgfe: 0.121178 hartree
zpe.sumelectzpe: -1101.949969 hartree
zpe.sumelectthermal: -1101.935886 hartree
zpe.sumelectthermalent: -1101.934942 hartree
zpe.sumelectthermalfe: -1101.992078 hartree
dipole: -3.2617 -0.1310 -0.0045
dipole: 3.2643
quadrupole: -95.7797 -119.0539 -118.2329
quadrupole: -7.3583 0.0225 -0.0082
quadrupole: 15.2425 -8.0317 -7.2108 -7.3583 0.0225 -0.0082
hfenergy: -1102.1132555 hartree
pointgroup: C01 [X(C13H7Br1Cl1N1O1)]
dipole: -1.2657129 0.2176312 0.0017659 debye
dipolederiv: -0.4171926 0.304277 0.0002022 0.4115183 -0.4381504 0.000001 0.0002367 -0.000181 -0.0229164 -0.6469384 -0.3703983 0.0000118 -0.5395381 -0.4972824 0.0000021 -0.0000281 0.0000235 -0.0628283 -0.5443319 -0.0179368 0.0000058 0.0109067 -1.1698681 -0.0000562 -0.0000246 0.000158 -0.2997627 -1.8178124 -0.3179343 -0.000835 -0.3516718 -0.176669 -0.0002553 -0.0029382 -0.0009466 -0.6905079 -0.4878061 -0.1149012 -0.0001067 -0.0165393 -0.1176821 0.0000295 0.0001005 -0.0001047 -0.0571766 0.9708078 0.1380303 0.0000032 0.1456397 0.1459966 -0.0000562 -0.0000921 0.0000015 0.0222366 -0.4741249 0.520107 0.000147 0.3092929 -0.1247003 -0.0000126 0.0000503 0.0000435 0.059133 -0.9410476 -0.2633901 0.0000446 0.0250361 -0.3136859 0.0000625 -0.0000363 0.0000108 0.0143123 1.4226704 0.0043883 -0.0000619 -0.0035058 1.4124231 0.0000612 -0.0000092 -0.0000625 0.1090936 0.1578591 0.09285 0.000193 0.1838095 -0.0743017 -0.0000551 0.0001028 -0.0000163 -0.0420758 -0.2025099 -0.3655166 -0.0001417 0.426855 0.1304132 0.0000269 0.0000985 0.0000042 -0.174219 -0.7939987 -0.2639484 -0.0000175 -0.3434581 -0.1031158 0.0000044 0.0000796 -0.0000471 -0.1214071 0.458316 0.1175244 -0.0000174 -0.0710621 0.1656352 -0.000027 -0.0000093 0.0000126 -0.1026402 1.6035197 0.5845388 0.000777 0.613044 -0.2281554 0.0000299 0.0007739 0.0002734 0.1734168 0.1528064 -0.5694191 -0.0004262 -1.3331697 0.6482976 0.0001355 -0.0003112 0.0002554 -0.1990255 1.0840666 0.570901 0.0000348 0.7556484 0.7362307 -0.0000222 -0.0000517 0.0000101 -0.0388307 -0.3149246 -0.1217461 -0.0000209 -0.2994903 -0.3556507 0.0000177 0.0000324 -0.0000208 -0.1438835 0.1002009 -0.0575547 -0.0000177 -0.0361888 -0.0176309 -0.0000235 -0.0000573 0.0000113 0.151183 0.0289616 -0.023031 0.0000165 -0.0594952 -0.0183978 0.0000109 -0.0000198 -0.0000368 0.1703403 0.0856991 0.0487768 -0.0000088 0.0343935 -0.0166933 0.0000071 0.0000125 0.0000051 0.1629948 0.0785225 0.0023527 -0.0000169 0.0566353 -0.0214395 0.000015 0.0000232 -0.0000231 0.1592722 -0.0443033 0.0226561 0.0000158 0.0090161 0.0971834 0.0000063 0.0000017 0.0000047 0.1741889 0.2847965 0.0278958 0.000138 -0.0443011 0.191996 -0.0001531 0.0009882 0.0000107 0.3772758 0.256764 0.0514783 0.0000814 0.1166248 0.1452476 0.0002512 0.0010777 0.0006141 0.3818264 unknown
polarizability: 330.5972282|-2.109097|210.7611492|-0.0057665|0.0094086|62.0300833 unknown
InChI: InChI=1S/C13H7BrClNO/c14-11-4-9-8-3-6(15)1-2-7(8)13(17)10(9)5-12(11)16/h1-5H,16H2
charge 0 multiplicity 1
24 atoms
Br -4.005481 2.641305 0.000622
Cl 4.619668 2.315898 -0.000027
O  0.215536 -3.171772 0.000183
N  -4.598546 -0.462618 -0.000562
C  -0.434955 0.37946 -0.000017
C  1.046672 0.342464 -0.000041
C  -0.921666 -0.961862 -0.000041
C  1.465827 -1.025261 -0.000024
C  0.252079 -1.909719 -0.000083
C  -1.349875 1.445307 0.000118
C  -2.283736 -1.259941 -0.00003
C  2.00029 1.375181 -0.000053
C  2.824269 -1.376528 0.000023
C  -3.24034 -0.192238 -0.000003
C  -2.729563 1.144379 0.000188
C  3.36493 0.997686 -0.000017
C  3.798154 -0.346168 0.00003
H  -1.023145 2.489533 0.000232
H  -2.623372 -2.302214 -0.000116
H  1.719528 2.432456 -0.000082
H  3.125654 -2.428933 0.000046
H  4.866588 -0.578628 0.000057
H  -5.276696 0.296336 0.000765
H  -4.933618 -1.421822 0.00093
