program: Gaussian 09
title: 000252785
version: EM64L-G09RevD.01
frameworkgroup: C1[X(C13H9Cl2N)]
method: RPBEPBE
basis: SDD
operation: Freq
keyword: #p
keyword: freq=noraman
keyword: PBEPBE/SDD
title: #p freq=noraman PBEPBE/SDD
converged: YES YES NO NO
title: Mulliken charges:
elementType: Cl Cl N C C C C C C C C C C C C C H H H H H H H H H
charge: -0.074089 -0.064833 -0.699309 -0.697294 0.011873 0.322807 0.273488 0.243653 0.390507 -0.478027 -0.407060 -0.348479 -0.422451 -0.064112 -0.100313 -0.254393 0.250243 0.250252 0.267933 0.268020 0.204854 0.243220 0.253284 0.314211 0.316015
chargesum: 0.00000
title: Mulliken charges with hydrogens summed into heavy atoms:
elementType: Cl Cl N C C C C C C C C C C C C C
charge: -0.074089 -0.064833 -0.069083 -0.196798 0.011873 0.322807 0.273488 0.243653 0.390507 -0.210094 -0.139040 -0.143625 -0.179231 -0.064112 -0.100313 -0.001109
polarizability: 2.99568035e+02 1.43056830e+00 1.69795287e+02 8.93574949e-04 -1.53121708e-02 6.55233274e+01
1716.lowfreq: -0.0016 0.0015 0.0028 3.6300 4.3634 14.2697 39.4233 62.4756 123.2630
frequency: 39.4080 62.4595 123.2625 137.5730 196.9606 220.2387 228.8012 236.2838 240.4615 286.0510 308.0469 375.4563 375.9343 396.7809 410.2959 433.8126 493.4447 495.7789 540.7361 563.5544 565.4666 580.3097 589.2956 669.7527 695.5597 708.7732 747.7594 799.6789 832.0728 841.3010 845.9588 854.6382 876.5088 923.9733 956.0563 986.8767 1003.0757 1060.5535 1073.1328 1102.7041 1128.8666 1137.2284 1181.8629 1201.7818 1224.2531 1270.3994 1284.7533 1319.5991 1369.1653 1400.4868 1418.7573 1429.8703 1441.2965 1456.9028 1477.4713 1579.5133 1597.4614 1607.5004 1610.4983 1645.0070 2988.3486 3033.5146 3142.4730 3151.9910 3156.5293 3171.0867 3171.2874 3579.9128 3726.0842
redmass: 7.4366 4.2983 12.8076 6.7204 3.7535 7.9759 2.6672 10.4926 3.3268 5.3930 1.3652 6.3145 3.0050 6.5251 1.5283 2.1006 6.4814 3.0672 4.6580 3.6668 4.3984 4.3678 5.8894 6.7806 3.3584 6.0394 2.4118 1.9178 1.3620 6.3722 1.6343 5.3469 1.3784 1.3951 2.1827 6.9078 2.2339 3.0849 1.9277 1.5155 2.1244 1.1399 1.4742 1.8529 1.5889 2.0346 1.5991 4.3465 5.2836 5.0819 1.9372 1.7251 3.3053 3.8638 4.3261 7.5422 8.0657 7.3508 5.2828 1.2621 1.0610 1.0993 1.0875 1.0920 1.0932 1.0954 1.0941 1.0463 1.1019
irintensity: 2.0986 3.0871 1.0087 3.0891 6.5156 0.1044 0.0021 0.8121 7.4701 6.5903 52.9585 20.3213 82.4231 8.8961 23.8531 103.0034 0.0367 4.1594 0.6472 6.2275 5.9159 3.7287 3.5423 0.8119 3.3084 9.1127 25.5533 39.5482 15.1474 72.8553 48.5265 14.2346 4.3901 1.2005 16.6963 15.0440 18.9392 17.2025 33.5733 8.3003 6.8186 0.0087 18.2349 2.3034 8.8605 0.5637 13.9791 56.0576 6.8603 6.4306 37.8189 67.4705 6.1587 75.7281 11.0055 21.6705 125.4610 10.5489 89.9503 236.3590 9.4145 5.4339 24.2421 5.8392 1.9645 7.6340 0.8026 48.7555 31.8110
temp: 298.150 k
press: 1.00000 atm
elementType: 17 17 7 6 6 6 6 6 6 6 6 6 6 6 6 6 1 1 1 1 1 1 1 1 1
symmnumber: 1
zpe: 477206.5 jmol-1
zpe.correction: 0.181758 hartree
zpe.thermalcorrener: 0.195276 hartree
zpe.thermalcorrenthalpy: 0.196221 hartree
zpe.thermalcorrgfe: 0.141087 hartree
zpe.sumelectzpe: -1474.582006 hartree
zpe.sumelectthermal: -1474.568488 hartree
zpe.sumelectthermalent: -1474.567543 hartree
zpe.sumelectthermalfe: -1474.622677 hartree
dipole: -0.0602 2.2245 0.0065
dipole: 2.2254
quadrupole: -127.9628 -83.3762 -111.8432
quadrupole: -4.3243 -0.0115 0.0149
quadrupole: -20.2354 24.3512 -4.1158 -4.3243 -0.0115 0.0149
hfenergy: -1474.7637641 hartree
pointgroup: C01 [X(C13H9Cl2N1)]
dipole: -0.0311512 -0.8749308 0.0080392 debye
dipolederiv: -1.0077464 0.1683942 -0.0014644 0.1917034 -0.1800982 0.0010353 -0.0016465 0.0011097 -0.0834046 -1.0339349 -0.1088585 0.0016381 -0.1663047 -0.150635 0.001025 0.0023561 0.0010103 -0.0742516 -0.1617646 0.306536 -0.0046708 -0.0603723 -1.3596612 0.0081507 -0.0002833 0.0092088 -0.6969706 -0.0342093 0.0005544 0.0001389 -0.0274885 -0.1157446 0.0032108 0.0003736 0.0031536 0.1419531 -0.2585515 -0.1217066 0.0015001 0.2149551 -0.4233201 0.0040686 -0.0020636 0.0043643 -0.0699983 0.3938003 0.089122 -0.0014086 -0.2882248 0.2405169 -0.0030275 0.0031444 -0.0031588 -0.0153562 -0.1378448 -0.1591363 0.0019567 -0.2900711 0.1201184 -0.0018692 0.0035443 -0.0018228 -0.0373624 0.6690597 -0.0474385 0.0005574 0.094488 -0.1368607 0.0020171 -0.0012919 0.0020897 0.0248404 0.1519819 -0.4024896 0.0048833 0.1361255 1.4063656 -0.0145986 -0.0015535 -0.0140278 0.1535248 -0.8096643 -0.0801266 0.0012813 -0.0933579 -0.1846549 -0.0003144 0.0014585 -0.000237 -0.2028933 -0.1722448 0.0934011 -0.0011228 0.0061445 0.0253118 -0.0019271 -0.0000102 -0.0019531 -0.1279566 -0.0247228 0.0176086 -0.0003837 0.0977558 0.1086085 -0.0038741 -0.0014559 -0.0042263 -0.1745674 -0.2944157 0.4853716 -0.0055635 0.0170165 -0.3806441 0.0020799 -0.0002196 0.00136 -0.2059575 1.3695923 -0.2176312 0.0016679 0.0560442 0.5677116 -0.0070329 -0.0017836 -0.0069264 -0.0242094 1.2300827 0.1354553 -0.0020918 0.4277902 0.1753578 -0.0033007 -0.005878 -0.0031952 -0.0733482 -0.3869228 -0.0701466 0.0010388 -0.2682135 -0.0505617 -0.0008904 0.0035042 -0.0009552 -0.1177028 0.0030229 -0.0004578 -0.0032015 -0.000368 0.0303924 -0.0828981 -0.0028076 -0.1166689 0.0086691 0.002992 -0.000288 0.0031367 -0.0001718 0.035365 0.0822588 0.0027938 0.1160291 0.0037189 0.0759675 0.0190044 -0.0001773 0.0476586 -0.0277491 0.0024962 -0.0004352 0.0025224 0.1783522 0.0805345 -0.0296443 0.0003914 -0.0597581 -0.0273112 0.0024179 0.0007963 0.0023797 0.1621248 0.0355082 -0.1090978 0.0013792 -0.0852598 -0.1227402 0.0036655 0.0010459 0.0038663 0.1562074 0.0109193 -0.0653925 0.0008004 -0.0907631 -0.0168901 0.002308 0.0011123 0.0022055 0.1769933 0.0102335 0.073974 -0.000939 0.0799813 0.0173993 0.0019524 -0.0010084 0.0019591 0.1671855 0.1601728 0.022825 0.0003694 0.0462691 0.2135015 0.0016418 0.0004477 0.0009529 0.3564101 0.1281542 0.0001678 0.0002838 0.0144213 0.2362224 0.0014049 -0.0001399 0.0009601 0.3739992 unknown
polarizability: 299.5341562|-2.5381854|169.8135137|-0.0501552|-1.2766086|65.5389802 unknown
InChI: InChI=1S/C13H9Cl2N/c14-9-1-2-11-7(4-9)3-8-5-10(15)6-12(16)13(8)11/h1-2,4-6H,3,16H2
charge 0 multiplicity 1
25 atoms
Cl -5.154152 0.830617 0.00593
Cl 5.367059 0.467759 0.006008
N  -1.345753 -2.715966 0.045293
C  0.146723 1.941815 -0.011272
C  -0.672987 -0.333422 0.017353
C  -1.076395 1.036439 0.000684
C  1.302574 0.955199 0.000606
C  0.804091 -0.389297 0.017782
C  -1.666018 -1.361651 0.029873
C  -2.425346 1.427744 -0.003206
C  2.67767 1.233621 -0.003167
C  1.732084 -1.460877 0.031709
C  -3.039109 -0.971421 0.025977
C  -3.379995 0.389078 0.010032
C  3.570133 0.140024 0.010618
C  3.122269 -1.19441 0.028032
H  0.169023 2.613936 0.868517
H  0.168078 2.59188 -0.907507
H  -2.729781 2.476973 -0.015873
H  3.05469 2.260688 -0.016231
H  1.426379 -2.511536 0.046195
H  -3.82513 -1.733387 0.035269
H  3.844972 -2.015336 0.038711
H  -0.384828 -3.035488 0.045819
H  -2.082255 -3.415783 0.053453
