program: Gaussian 09
title: 000252782
version: EM64L-G09RevD.01
frameworkgroup: C1[X(C15H9Cl2NO2)]
method: RPBEPBE
basis: SDD
operation: Freq
keyword: #p
keyword: freq=noraman
keyword: PBEPBE/SDD
title: #p freq=noraman PBEPBE/SDD
converged: NO YES NO NO
title: Mulliken charges:
elementType: Cl Cl O O N C C C C C C C C C C C C C C C H H H H H H H H H
charge: -0.033209 -0.033558 -0.142432 -0.239262 -0.450062 0.058848 0.359434 0.248727 0.189732 -0.319956 0.380934 -0.465926 -0.327580 -0.402742 -0.272357 -0.120033 -0.236569 -0.107673 0.227807 -0.802648 0.305209 0.211278 0.306321 0.334305 0.313618 0.259574 0.240808 0.276572 0.240841
chargesum: 0.00000
title: Mulliken charges with hydrogens summed into heavy atoms:
elementType: Cl Cl O O N C C C C C C C C C C C C C C C
charge: -0.033209 -0.033558 -0.142432 -0.239262 -0.136444 0.058848 0.359434 0.248727 0.189732 -0.319956 0.380934 -0.160717 -0.116303 -0.096421 0.061948 -0.120033 0.023006 -0.107673 0.227807 -0.044428
polarizability: 3.44089389e+02 -1.03238180e+01 2.36652996e+02 -3.78644321e-03 -3.35123938e-03 7.53218055e+01
1716.lowfreq: -63.6286 -5.3503 -1.7203 0.0008 0.0012 0.0019 3.3568 25.3289 47.4135
frequency: -63.6257 25.3228 47.4086 49.7558 87.0349 97.8318 127.5872 145.6949 150.7499 194.1994 223.0751 230.6704 249.5453 266.3091 287.8129 327.5446 370.4079 374.4514 395.3283 414.9109 468.6152 500.4730 537.3276 551.8903 553.7525 563.8777 590.4840 599.7163 626.9424 670.2777 684.9048 689.4575 734.8031 763.8089 812.5122 815.6814 815.9275 885.5596 904.6819 929.6508 931.3052 935.4115 939.8628 970.7052 991.8718 1033.9303 1037.0844 1063.1165 1085.0169 1120.0280 1172.9749 1200.3988 1215.5158 1230.9364 1271.9327 1281.2701 1352.1920 1374.4940 1378.5531 1396.2766 1429.1240 1446.1528 1453.4258 1465.8560 1468.4323 1497.3011 1580.5020 1588.0943 1600.6317 1606.7994 1632.7690 1642.2006 2988.3763 3073.3650 3126.6425 3140.0248 3166.4810 3171.3845 3175.5093 3187.6122 3572.1321
redmass: 1.0560 4.8779 8.1415 9.5824 6.0787 4.6927 14.4147 5.7684 7.2032 12.1279 5.9401 10.2885 4.3573 12.8971 6.1533 5.6827 5.8409 4.6973 10.8333 4.0541 4.9479 4.7270 6.9627 6.3320 3.3497 3.3565 2.3577 8.0449 1.7832 6.1526 8.4999 4.2299 5.8493 2.6714 1.9528 8.9323 3.3394 5.0660 1.4469 1.6012 6.4584 1.3947 1.5406 2.7138 4.0240 1.6676 4.2331 2.0214 1.6225 3.1552 2.0126 2.0123 1.9546 3.3003 1.4320 2.7961 6.7709 3.8870 1.2322 3.3884 3.4033 1.4159 2.7394 3.8387 1.0463 2.0721 6.9248 7.7161 8.3623 7.5448 11.8600 5.1025 1.0386 1.0984 1.0894 1.0978 1.0935 1.0948 1.0941 1.0933 1.0757
irintensity: 0.0223 2.8493 0.5083 9.3491 3.2081 0.1305 0.3396 0.0476 1.1752 0.4500 0.1705 2.7485 1.9770 1.6412 2.1357 0.8964 7.0777 1.2561 21.6466 0.0356 21.8170 14.2680 3.8274 11.7288 0.5756 0.0673 1.9238 0.5434 57.1299 2.4804 62.2592 1.8720 7.5526 20.6990 34.5382 8.2406 21.1983 34.6811 4.3790 22.7244 11.4486 19.7634 6.8577 25.8620 8.4170 8.1894 6.9236 8.0155 17.2413 69.8816 20.8889 16.8001 39.2021 88.4846 19.3550 205.4652 138.9125 5.8195 53.2761 272.3383 166.5409 4.1158 146.4646 34.5238 22.0690 240.9641 37.6071 14.1793 212.3349 15.1346 143.7609 120.5075 5.1665 12.2076 31.9660 5.9533 0.7759 4.0430 2.8105 26.2085 28.8302
temp: 298.150 k
press: 1.00000 atm
elementType: 17 17 8 8 7 6 6 6 6 6 6 6 6 6 6 6 6 6 6 6 1 1 1 1 1 1 1 1 1
symmnumber: 1
zpe: 524931.4 jmol-1
zpe.correction: 0.199936 hartree
zpe.thermalcorrener: 0.216642 hartree
zpe.thermalcorrenthalpy: 0.217587 hartree
zpe.thermalcorrgfe: 0.153725 hartree
zpe.sumelectzpe: -1700.973657 hartree
zpe.sumelectthermal: -1700.956950 hartree
zpe.sumelectthermalent: -1700.956006 hartree
zpe.sumelectthermalfe: -1701.019868 hartree
dipole: -2.2534 5.4461 0.0013
dipole: 5.8939
quadrupole: -152.9534 -121.4993 -130.6833
quadrupole: -7.2617 0.0050 0.0046
quadrupole: -17.9081 13.5460 4.3621 -7.2617 0.0050 0.0046
hfenergy: -1701.1735927 hartree
pointgroup: C01 [X(C15H9Cl2N1O2)]
dipole: 0.480712 2.268453 -0.0004036 debye
polarizability: 336.808179|28.9107242|243.9341834|0.0762577|0.0093075|75.3218277 unknown
InChI: InChI=1S/C15H9Cl2NO2/c1-7(19)18-13-6-9(17)5-12-14(13)10-3-2-8(16)4-11(10)15(12)20/h2-6,18H,1H3
charge 0 multiplicity 1
29 atoms
Cl -3.916006 -3.11344 -0.001104
Cl 5.647389 1.262291 0.001771
O  1.881187 -3.159749 0.000395
O  -4.120377 1.882811 -0.000875
N  -1.775293 1.68238 -0.000814
C  -0.270019 -0.259419 -0.000133
C  1.088019 0.364163 0.00033
C  -0.108141 -1.6777 -0.000108
C  2.060071 -0.686879 0.000536
C  1.355479 -2.014117 0.000272
C  -1.585327 0.278378 -0.000578
C  -1.180026 -2.577993 -0.0004
C  1.552287 1.697572 0.000639
C  3.440723 -0.454453 0.000969
C  -2.696021 -0.62221 -0.000851
C  -2.472301 -2.008538 -0.000743
C  2.947779 1.958919 0.001071
C  3.8674 0.891937 0.001215
C  -2.975696 2.415121 -0.000898
C  -2.761343 3.927709 -0.001352
H  -1.012781 -3.658114 -0.000355
H  0.8917 2.571086 0.000639
H  4.148586 -1.288687 0.001116
H  -3.707903 -0.213281 -0.001121
H  -0.924475 2.243811 -0.001011
H  3.312331 2.990358 0.001313
H  -2.200993 4.253622 0.894709
H  -3.743297 4.421002 -0.001248
H  -2.201452 4.253119 -0.897885
