program: Gaussian 09
title: 000252781
version: EM64L-G09RevD.01
frameworkgroup: C1[X(C15H10O3)]
method: RPBEPBE
basis: SDD
operation: Freq
keyword: #pfreq=noraman
keyword: PBEPBE/SDD
title: #p freq=noraman PBEPBE/SDD
converged: NO YES NO NO
title: Mulliken charges:
elementType: O O O C C C C C C C C C C C C C C C H H H H H H H H H H
charge: -0.291933 -0.173983 -0.194300 0.295830 0.275284 -0.012174 0.241595 -0.201169 0.309893 -0.436956 -0.388700 -0.423701 -0.393696 -0.187536 -0.218542 -0.230684 0.270280 -0.749588 0.251273 0.247084 0.281054 0.258039 0.234233 0.232197 0.236977 0.278601 0.243339 0.247285
chargesum: 0.00000
title: Mulliken charges with hydrogens summed into heavy atoms:
elementType: O O O C C C C C C C C C C C C C C C
charge: -0.291933 -0.173983 -0.194300 0.295830 0.275284 -0.012174 0.241595 -0.201169 0.309893 -0.185683 -0.141617 -0.142647 -0.135657 0.046697 0.013654 0.006293 0.270280 0.019637
polarizability: 2.47357116e+02 1.34630975e+01 2.02860803e+02 -1.06850370e+01 4.96900569e+00 8.10594113e+01
1716.lowfreq: -8.1933 -3.6418 -2.5057 0.0006 0.0006 0.0007 54.2931 65.3522 71.0705
frequency: 54.2731 65.3485 71.0663 106.1475 123.2604 125.7947 155.3431 187.4235 242.4177 264.6778 284.5671 304.5030 337.0801 416.3588 442.1653 444.4429 494.7654 509.1228 531.9066 533.9463 565.1520 587.7453 638.8839 653.7122 669.2458 688.4362 746.9376 751.5008 772.7856 790.2654 820.9946 844.4213 877.5282 900.5910 913.7916 921.3376 967.8288 983.1447 985.9622 997.5056 1015.4376 1037.4753 1044.1921 1071.1764 1102.2517 1146.3753 1148.7247 1168.2328 1181.0284 1194.7681 1221.8146 1267.2037 1293.2627 1371.7618 1379.0519 1397.7159 1435.1033 1448.9639 1450.4073 1454.9234 1458.1573 1478.3886 1587.0199 1601.3263 1603.9337 1617.2692 1632.6716 1700.0666 3008.8334 3103.7735 3130.1014 3138.2969 3142.4230 3143.2355 3153.0743 3156.5216 3168.0374 3176.3965
redmass: 6.5649 3.8138 5.3947 4.7651 4.0339 1.1595 7.0684 5.8010 4.3810 9.3803 5.9414 3.7057 6.8427 3.3298 4.6614 5.5317 4.6096 3.9648 6.1763 3.6350 6.4245 4.8948 6.2153 6.3201 4.5486 4.4452 1.9692 3.1338 1.8125 4.4194 2.1632 4.2366 6.8881 1.4625 1.6533 6.0686 1.4525 1.3691 2.2327 1.3588 2.2228 1.6761 2.6309 2.4388 2.2653 2.7208 2.6721 1.1544 1.2306 2.6656 2.5857 2.2206 1.7717 8.0373 1.2493 2.7976 2.4033 2.9631 1.0813 1.0601 2.8196 4.7658 8.8623 7.7830 6.7953 8.0997 10.2761 10.8472 1.0371 1.0953 1.0862 1.0873 1.0900 1.1024 1.0947 1.0938 1.1003 1.0975
irintensity: 4.7435 3.3325 2.4692 1.5315 1.6778 0.0158 0.0773 0.2906 0.0582 2.6901 0.5066 3.3669 1.7977 0.2387 5.0908 2.4434 4.9277 3.7938 6.1935 2.7082 4.4544 6.7252 5.1120 4.9261 11.0418 22.8140 9.0872 7.9534 79.0242 61.6119 43.1536 4.1286 104.0553 0.1178 0.4048 15.5127 2.9248 1.9853 107.7454 0.0040 3.1892 7.8168 12.4240 10.4509 86.9879 327.3335 119.6332 3.6972 0.2057 42.5636 13.6152 19.6764 11.7480 3.3453 83.5884 2.1329 34.8147 14.3573 19.1644 21.6900 28.0322 2.2582 91.6421 124.4223 33.4034 99.2300 94.0741 166.1196 1.0427 8.0597 2.0312 5.9997 3.7620 8.9212 9.5933 18.4662 31.2180 9.8838
temp: 298.150 k
press: 1.00000 atm
elementType: 8 8 8 6 6 6 6 6 6 6 6 6 6 6 6 6 6 6 1 1 1 1 1 1 1 1 1 1
symmnumber: 1
zpe: 541919.0 jmol-1
zpe.correction: 0.206406 hartree
zpe.thermalcorrener: 0.220940 hartree
zpe.thermalcorrenthalpy: 0.221884 hartree
zpe.thermalcorrgfe: 0.164529 hartree
zpe.sumelectzpe: -802.056149 hartree
zpe.sumelectthermal: -802.041615 hartree
zpe.sumelectthermalent: -802.040671 hartree
zpe.sumelectthermalfe: -802.098026 hartree
dipole: -1.9534 2.5758 -1.0511
dipole: 3.3993
quadrupole: -79.9324 -90.0667 -112.1070
quadrupole: 0.4940 -4.8692 2.2915
quadrupole: 14.1030 3.9686 -18.0717 0.4940 -4.8692 2.2915
hfenergy: -802.2625551 hartree
pointgroup: C01 [X(C15H10O3)]
dipole: -0.7192131 -1.032651 0.4527505 debye
polarizability: 248.5324078|-10.8573211|201.9120317|10.9747901|0.8576094|80.8328907 unknown
InChI: InChI=1S/C15H10O3/c1-9(16)18-13-8-4-7-11-10-5-2-3-6-12(10)15(17)14(11)13/h2-8H,1H3
charge 0 multiplicity 1
28 atoms
O  2.910129 0.04526 0.462697
O  0.586476 2.105094 0.370679
O  2.704426 1.043929 -1.655601
C  -0.575698 -1.295533 0.001152
C  -1.845199 -0.521983 -0.075373
C  0.503486 -0.370575 0.14637
C  -1.536367 0.865191 0.046066
C  -0.049421 1.026252 0.202487
C  1.823399 -0.838006 0.253946
C  -0.334539 -2.678397 -0.030057
C  -3.178844 -0.936129 -0.230878
C  -2.535437 1.849235 0.013924
C  2.081153 -2.230014 0.233595
C  1.006446 -3.135062 0.093568
C  -4.195888 0.056247 -0.265322
C  -3.882484 1.4322 -0.145225
C  3.176541 1.073912 -0.510247
C  4.086942 2.105431 0.09823
H  -1.152227 -3.397889 -0.140159
H  -3.441343 -1.995396 -0.325667
H  -2.272058 2.907708 0.108716
H  3.112895 -2.582462 0.321958
H  1.215489 -4.210109 0.075353
H  -5.241306 -0.248453 -0.387598
H  -4.686221 2.175414 -0.176071
H  3.461876 2.786856 0.703757
H  4.585549 2.6839 -0.693184
H  4.827024 1.637579 0.766383
