program: Gaussian 09
title: 000252775
version: EM64L-G09RevD.01
frameworkgroup: C1[X(C14H7NO2)]
method: RPBEPBE
basis: SDD
operation: Freq
keyword: #p
keyword: freq=noraman
keyword: PBEPBE/SDD
title: #p freq=noraman PBEPBE/SDD
converged: NO YES NO NO
title: Mulliken charges:
elementType: O O N C C C C C C C C C C C C C C H H H H H H H
charge: -0.167971 -0.123862 0.013941 0.329563 0.269224 0.005951 0.250134 -0.238996 0.178727 -0.440793 -0.388757 -0.422776 -0.395373 -0.189169 -0.217981 -0.229976 0.013424 0.252856 0.248235 0.283793 0.261007 0.236640 0.233612 0.238544
chargesum: 0.00000
title: Mulliken charges with hydrogens summed into heavy atoms:
elementType: O O N C C C C C C C C C C C C C C
charge: -0.167971 -0.123862 0.013941 0.329563 0.269224 0.005951 0.250134 -0.238996 0.178727 -0.187936 -0.140521 -0.138982 -0.134366 0.047471 0.015631 0.008568 0.013424
polarizability: 2.53362748e+02 -3.35651971e-01 2.07351927e+02 3.41370621e-03 5.14194437e-03 5.92326077e+01
1716.lowfreq: -6.6112 -0.0008 -0.0006 0.0005 4.7399 6.6901 56.0229 71.2699 96.8831
frequency: 55.9944 71.2699 96.8824 129.2949 151.2064 193.0550 250.7143 268.2702 279.0564 340.9681 391.4557 416.5437 441.2131 465.9862 510.0359 514.9306 518.3059 536.8706 574.8515 616.2005 646.6288 658.5899 673.8201 748.2543 755.0717 774.3412 820.6694 839.7288 847.4368 902.8993 907.4296 916.1882 970.0970 988.0135 999.7747 1013.8199 1037.8093 1064.9759 1089.9683 1148.2247 1153.8983 1170.9235 1190.5670 1201.8140 1268.0825 1291.9391 1368.8046 1402.5772 1418.4473 1433.2479 1454.8694 1472.1022 1514.9789 1575.3756 1602.4634 1610.9659 1613.3503 1629.3005 2279.2789 3131.6880 3140.0093 3143.8255 3154.5952 3157.8995 3169.4478 3176.5982
redmass: 9.4933 11.6414 5.5251 5.1316 6.6612 5.9755 4.5406 10.9971 5.9619 8.1485 8.2468 3.2934 4.1775 6.9804 12.6233 8.2836 3.6218 8.9633 8.0015 4.1980 6.8165 6.9494 3.7912 1.6534 6.6378 1.5131 1.9656 6.8538 4.0991 1.4743 7.3297 1.5684 1.4550 1.3606 1.3583 2.4458 3.4019 2.3607 2.4225 2.6029 2.0284 1.1473 1.5695 2.0609 2.2346 1.6729 6.9892 2.9238 2.6355 3.2312 2.6729 4.8616 6.9546 9.1192 7.2192 8.2531 7.1810 9.6560 12.7158 1.0863 1.0873 1.0901 1.0947 1.0937 1.1003 1.0979
irintensity: 0.9654 0.6733 2.2109 0.3700 0.0926 0.3176 0.0155 6.2459 0.0038 3.5816 0.6699 0.7185 4.3510 6.3509 14.8845 5.1221 0.0411 14.7834 4.9032 2.4583 0.0856 14.7844 14.9440 4.4596 2.9531 124.4960 32.8548 32.5492 0.2603 0.1834 18.9732 0.0001 3.4104 1.9394 0.0077 0.5708 16.6764 1.1870 32.5335 25.0160 3.0318 3.5203 9.8525 79.8972 24.3998 13.0296 3.7816 2.9473 33.3725 8.4417 6.1330 12.5645 32.4660 114.7211 7.8490 209.0390 38.9613 89.0145 1315.7580 1.8615 6.1652 3.6819 8.6782 16.2781 30.4363 11.0888
temp: 298.150 k
press: 1.00000 atm
elementType: 8 8 7 6 6 6 6 6 6 6 6 6 6 6 6 6 6 1 1 1 1 1 1 1
symmnumber: 1
zpe: 444735.1 jmol-1
zpe.correction: 0.169391 hartree
zpe.thermalcorrener: 0.181977 hartree
zpe.thermalcorrenthalpy: 0.182921 hartree
zpe.thermalcorrgfe: 0.129938 hartree
zpe.sumelectzpe: -741.781563 hartree
zpe.sumelectthermal: -741.768976 hartree
zpe.sumelectthermalent: -741.768032 hartree
zpe.sumelectthermalfe: -741.821016 hartree
dipole: 3.9646 4.7529 0.0006
dipole: 6.1894
quadrupole: -87.5822 -92.2015 -99.3005
quadrupole: -11.9000 0.0028 -0.0011
quadrupole: 5.4458 0.8266 -6.2724 -11.9000 0.0028 -0.0011
hfenergy: -741.9509534 hartree
pointgroup: C01 [X(C14H7N1O2)]
dipole: -1.373642 2.0097889 -0.058871 debye
dipolederiv: -0.6217363 0.1883808 -0.0106656 0.0644377 -0.8438463 0.0082562 -0.0091215 0.0112292 -0.2912226 -0.6794379 0.5434784 -0.0181037 0.9457115 -1.3195833 0.0372117 -0.0229653 0.0270503 -0.2252487 -0.9828381 0.3742841 -0.0236688 1.2755595 -1.6692307 0.0496988 -0.0344634 0.0271045 -0.221867 0.1857133 0.1227928 0.0029057 0.1965855 0.2099425 0.0027148 0.0022472 0.0008934 0.0163495 0.2670971 -0.0235332 0.0071597 0.0742996 0.0047436 0.001767 0.0059675 -0.0006683 -0.0029141 -0.804534 -0.110952 -0.018835 -0.4104659 -0.5271563 -0.0042494 -0.0151772 0.0032871 -0.0090178 -0.7055151 0.0789715 -0.0195901 -0.06992 -0.1462862 0.0002838 -0.0178623 0.0040491 0.0267569 1.3761329 -0.0625415 0.0325045 0.2707732 1.0608801 -0.0042735 0.0284188 -0.0126369 0.1261922 1.1215479 -0.3570528 0.0284844 -0.9649902 0.9691574 -0.0339314 0.035551 -0.0186217 0.1603237 -0.3273345 -0.1897074 -0.0017901 -0.2870471 -0.1468129 -0.007512 -0.0006819 -0.0050841 -0.1716321 -0.3580663 -0.0274311 -0.0050764 -0.1296065 0.1137346 -0.0064157 -0.0039475 -0.0038555 -0.1446185 0.0702677 -0.0848437 0.0057305 0.1295951 0.1602012 0.0000623 0.0032248 -0.0053777 -0.1137557 -0.0561814 0.0542175 0.0027741 0.3196719 -0.3413611 0.0097794 -0.000283 0.0031075 -0.1953774 0.2727276 0.07353 0.0086865 0.005432 0.2144769 -0.0036651 0.0094494 -0.0019066 -0.1075124 0.2075344 -0.044123 0.0091829 -0.0036726 0.0008371 -0.0016739 0.0087697 -0.0026794 -0.1277649 0.0116508 0.1071692 0.0034029 0.1044967 -0.0714493 0.0015044 0.0034116 0.0015757 -0.1702467 0.9860816 -0.6515616 0.024538 -1.4962283 2.3488905 -0.0624418 0.0348132 -0.04117 0.3312431 0.0033313 0.1115403 -0.0052505 0.0694515 0.0086975 0.0035165 -0.0047736 0.004595 0.1607537 0.0945255 -0.0120087 -0.0014236 0.04048 -0.0877581 0.0039492 -0.0020725 0.0026179 0.1549927 0.1009504 0.0423333 -0.0020144 -0.0114488 -0.0291486 0.001958 -0.0013818 0.0032991 0.1601309 -0.0579022 -0.0422853 -0.005206 -0.0254741 0.0991462 0.0001821 -0.0054276 -0.0002477 0.1697761 0.0668457 -0.060802 -0.0014628 -0.0713526 -0.0970477 0.0011565 -0.0013104 0.0014213 0.1537006 -0.1068469 0.0615069 -0.0074911 0.0780093 0.0638669 0.0031163 -0.0076979 0.0027 0.1555825 -0.0640134 -0.0913625 -0.0047911 -0.1042975 0.0251061 -0.0009941 -0.0046872 -0.0006823 0.1653762 unknown
polarizability: 252.8822164|-3.9845032|207.6844069|4.96207|-1.863218|59.3806594 unknown
InChI: InChI=1S/C14H7NO2/c16-8-15-12-7-3-6-10-9-4-1-2-5-11(9)14(17)13(10)12/h1-7H
charge 0 multiplicity 1
24 atoms
O  0.512431 -2.260414 0.012809
O  3.735551 -2.802898 0.101156
N  3.034504 -0.476218 0.05492
C  -0.307952 1.252887 -0.049152
C  -1.656727 0.622607 -0.076069
C  0.668176 0.21126 -0.012352
C  -1.493844 -0.79503 -0.055139
C  -0.026684 -1.114919 -0.014165
C  2.049736 0.50532 0.018732
C  0.083133 2.59995 -0.055111
C  -2.944004 1.183662 -0.115922
C  -2.594452 -1.664557 -0.072946
C  2.446732 1.875845 0.012452
C  1.475572 2.894998 -0.02376
C  -4.06324 0.307822 -0.134253
C  -3.894912 -1.098154 -0.113022
C  3.282346 -1.6800 0.075984
H  -0.651566 3.410684 -0.082997
H  -3.094666 2.268465 -0.132855
H  -2.442758 -2.748646 -0.056264
H  3.513933 2.114462 0.036339
H  1.804427 3.939728 -0.027819
H  -5.074897 0.727397 -0.16539
H  -4.775535 -1.748852 -0.127875
