program: Gaussian 09
title: 000252772
version: EM64L-G09RevD.01
frameworkgroup: C1[X(C10H10N2O)]
method: RPBEPBE
basis: SDD
operation: Freq
keyword: #p
keyword: freq=noraman
keyword: PBEPBE/SDD
title: #p freq=noraman PBEPBE/SDD
converged: YES YES NO YES
title: Mulliken charges:
elementType: O N N C C C C C C C C C C H H H H H H H H H H
charge: -0.265293 -0.405051 -0.447826 0.325312 0.209601 0.513283 -0.538058 -0.322207 -0.396787 -0.456659 -0.229153 0.204649 -0.801657 0.318466 0.227064 0.257141 0.302998 0.211942 0.252316 0.304715 0.233913 0.267361 0.233928
chargesum: 0.00000
title: Mulliken charges with hydrogens summed into heavy atoms:
elementType: O N N C C C C C C C C C C
charge: -0.265293 -0.102053 -0.143111 0.325312 0.209601 0.513283 -0.219592 -0.095143 -0.139646 -0.244717 0.023163 0.204649 -0.066455
polarizability: 2.00467320e+02 8.42516954e+00 1.31167970e+02 -2.27158690e-03 1.45645803e-04 5.52492792e+01
1716.lowfreq: -91.3883 -9.1698 -4.4954 0.0006 0.0010 0.0011 1.2151 61.8169 71.4334
frequency: -91.3672 61.8160 71.4274 131.2770 179.9371 228.2823 291.7742 302.6576 366.8674 424.8069 425.4214 495.0600 502.5210 573.4961 595.1170 597.5107 628.1557 634.4347 637.4721 735.0216 751.7060 777.9251 792.5168 811.4191 860.9825 888.2437 917.7667 927.7555 931.8607 938.3570 993.9609 1028.2837 1064.0109 1094.8014 1149.3559 1158.1017 1225.2877 1242.1820 1247.8073 1286.2457 1330.2334 1372.6695 1376.8337 1416.5827 1447.7890 1465.1541 1468.5578 1471.1706 1514.3274 1528.0972 1595.9460 1626.8932 1639.2191 2985.9974 3070.9852 3111.6592 3136.0447 3146.5777 3191.6180 3214.6118 3240.1304 3525.9480 3613.7646
redmass: 1.0464 5.7762 3.7188 5.0199 4.4591 3.9249 5.1138 4.6971 4.6223 4.1906 2.8978 4.3787 1.3295 3.0863 2.4298 5.3354 1.1637 6.1045 3.0301 1.6198 5.5735 2.1940 1.7238 4.6802 1.3142 4.6884 1.3576 6.6401 1.4511 2.5772 1.6844 1.6524 1.5319 1.5601 1.3115 2.1082 2.2720 2.2382 1.4415 2.3625 2.0084 1.2553 4.9110 2.2902 1.2308 4.4530 1.0471 3.5545 2.8178 2.6822 5.6872 5.7567 6.3150 1.0382 1.0984 1.0879 1.0977 1.0960 1.0935 1.0907 1.1068 1.0764 1.0809
irintensity: 0.0054 5.3702 6.6475 6.4446 4.9893 1.9062 2.4066 1.5248 1.5476 5.6843 12.4180 11.9271 87.0743 8.5978 11.9241 3.7323 61.9534 1.0454 0.8962 69.8266 2.2823 55.0734 36.8420 2.4088 1.0287 9.1739 0.1658 5.7498 46.1604 3.6244 25.0404 7.8644 20.2439 21.2848 2.7035 2.3616 10.6030 85.9894 5.5787 20.5947 39.4508 52.0129 29.3924 51.6240 77.3594 23.1622 19.0925 243.3151 118.0728 49.1029 52.7061 140.4869 11.7490 12.4685 17.9425 14.4458 7.5931 19.6545 6.0581 0.5914 4.7199 11.6347 62.4777
temp: 298.150 k
press: 1.00000 atm
elementType: 8 7 7 6 6 6 6 6 6 6 6 6 6 1 1 1 1 1 1 1 1 1 1
symmnumber: 1
zpe: 475290.9 jmol-1
zpe.correction: 0.181029 hartree
zpe.thermalcorrener: 0.191429 hartree
zpe.thermalcorrenthalpy: 0.192373 hartree
zpe.thermalcorrgfe: 0.144577 hartree
zpe.sumelectzpe: -570.894686 hartree
zpe.sumelectthermal: -570.884286 hartree
zpe.sumelectthermalent: -570.883342 hartree
zpe.sumelectthermalfe: -570.931138 hartree
dipole: -1.6859 4.5822 0.0001
dipole: 4.8825
quadrupole: -50.9075 -71.9034 -81.3143
quadrupole: 7.3667 -0.0007 0.0010
quadrupole: 17.1342 -3.8617 -13.2726 7.3667 -0.0007 0.0010
hfenergy: -571.0757152 hartree
pointgroup: C01 [X(C10H10N2O1)]
dipole: 0.67251 1.7993706 0.0034914 debye
dipolederiv: -0.6097725 0.1036648 0.0001106 -0.5523767 -0.9605774 -0.0011335 -0.0013303 -0.0013559 -0.3453676 -0.6575929 0.0301192 -0.0000003 -0.2353185 -0.4478121 -0.0003569 -0.0005153 -0.0003302 -0.2765426 -1.5797452 -0.2935928 -0.0008038 -0.6798726 -0.4881089 -0.000485 -0.0014825 -0.0003769 -0.3239122 0.0726685 -0.0535075 -0.0000912 -0.4555702 0.106635 0.0001014 -0.0008534 0.0001473 0.0222253 0.5751796 -0.0959523 -0.000106 0.1911015 -0.2706511 -0.0004917 0.0004246 -0.0005225 0.0046935 1.0805414 0.0436832 0.0002024 -0.0419719 -0.0492715 -0.0002553 0.0000108 -0.0002561 0.0885562 -0.1402065 -0.0545414 -0.0001029 0.122981 -0.0234608 0.0003193 0.0002364 0.0003169 -0.1865976 0.0446571 -0.1572148 -0.0002699 0.0065644 0.1711578 0.0006313 0.0000367 0.0006154 -0.1629647 -0.2390942 -0.0972912 -0.0001824 0.0419226 -0.0102802 0.000499 0.0000841 0.0004846 -0.2774815 -0.2532448 0.1433577 0.0002522 -0.0599453 0.0446074 0.0005376 -0.0000779 0.000559 -0.2390268 -0.0786655 0.1955346 0.0003796 0.3083969 0.4250245 0.001156 0.0006011 0.0011379 -0.1700262 1.5554187 0.139792 0.0006124 1.0143872 1.2847643 0.0022027 0.0026987 0.0023117 0.1611197 -0.4628816 0.086477 -0.0000082 0.1997544 -0.0508628 -0.000157 -0.0000967 -0.0001718 0.0637973 0.1703587 -0.0240089 -0.0000444 -0.0151877 0.0558295 -0.0002436 -0.000013 -0.0002468 0.1837104 0.0169166 -0.1009989 -0.0002109 -0.0782072 -0.0698582 -0.0004685 -0.000173 -0.0004717 0.1730873 0.0929354 -0.0264915 -0.0000616 0.0238521 -0.0491116 -0.0004589 0.0000295 -0.0004635 0.1992049 0.2187878 0.0209359 0.0000264 0.024505 0.1472153 -0.0003699 0.0000463 -0.000365 0.3477982 -0.0157757 0.1306953 0.0002288 0.1054817 -0.0548263 -0.0004132 0.0001893 -0.0004154 0.1694583 -0.0448319 0.0573214 0.0000765 0.040158 0.0865795 -0.0002348 0.0000413 -0.0002327 0.2147189 0.163305 -0.0096923 -0.0000217 0.0633426 0.0922863 -0.0003662 0.0001365 -0.0003356 0.2997686 0.0360799 0.0060064 -0.0065346 0.0505007 0.0350058 -0.1125331 0.0520068 -0.106791 -0.03831 0.0189306 -0.0501505 -0.0001299 -0.1250528 -0.0084379 -0.0003132 -0.0003031 -0.0002995 0.1295391 0.0360313 0.0058544 0.0066788 0.0505548 0.0341535 0.1128335 -0.0516969 0.1070617 -0.0374487 unknown
polarizability: 200.3793191|-8.7791988|131.2556989|0.0025381|0.1430676|55.249551 unknown
InChI: InChI=1S/C10H10N2O/c1-7(13)12-9-2-3-10-8(6-9)4-5-11-10/h2-6,11-12H,1H3
charge 0 multiplicity 1
23 atoms
O  -2.856061 -1.623109 -0.00374
N  3.388734 0.346588 0.000965
N  -2.220349 0.638228 0.000895
C  1.323701 -0.639538 -0.001129
C  2.015427 0.623486 0.001319
C  -0.792457 0.554458 0.000871
C  -0.09494 -0.673983 -0.001369
C  1.318659 1.851324 0.003547
C  2.335288 -1.676398 -0.002945
C  -0.085453 1.802169 0.003296
C  3.577507 -1.043953 -0.00162
C  -3.159078 -0.392596 -0.001082
C  -4.610558 0.097643 -0.000802
H  -0.650985 -1.612679 -0.003211
H  1.839826 2.81466 0.005432
H  2.165795 -2.751356 -0.004963
H  4.130856 1.042167 0.002326
H  -0.653823 2.741549 0.00502
H  4.578016 -1.472862 -0.002304
H  -2.598746 1.58832 0.002527
H  -4.830073 0.706478 0.896104
H  -5.273718 -0.778985 -0.002825
H  -4.829268 0.709991 -0.895514
