program: Gaussian 09
title: 000252771
version: EM64L-G09RevD.01
frameworkgroup: C1[X(C14H12O2)]
method: RPBEPBE
basis: SDD
operation: Freq
keyword: #pfreq=noraman
keyword: PBEPBE/SDD
title: #p freq=noraman PBEPBE/SDD
converged: NO YES NO NO
title: Mulliken charges:
elementType: O O C C C C C C C C C C C C C C H H H H H H H H H H H H
charge: -0.436333 -0.440058 -0.336923 0.026440 0.212593 0.215829 0.159554 0.210661 -0.419243 -0.403875 -0.386155 -0.388213 -0.452902 -0.216202 -0.233559 -0.230907 0.249524 0.242069 0.260946 0.241391 0.272479 0.253200 0.234931 0.227868 0.229761 0.341504 0.228482 0.337138
chargesum: 0.00000
title: Mulliken charges with hydrogens summed into heavy atoms:
elementType: O O C C C C C C C C C C C C C C
charge: -0.094829 -0.102920 -0.087399 0.026440 0.212593 0.215829 0.159554 0.210661 -0.177174 -0.142929 -0.144764 -0.115734 0.035229 0.011666 -0.003798 -0.002425
polarizability: 2.31840846e+02 1.00961945e+01 1.66317454e+02 -1.57360975e+00 7.40203123e+00 7.71102033e+01
1716.lowfreq: 0.0003 0.0003 0.0004 4.2004 6.3919 9.0156 47.7821 85.2705 108.0995
frequency: 47.7610 85.2588 108.0939 125.8143 148.6087 192.1369 211.1044 254.7264 302.3135 313.5353 352.7982 379.4796 385.8580 421.8798 438.2160 493.6228 524.4519 554.3426 572.7135 601.3368 614.3959 647.6560 700.7029 743.2780 746.4948 769.4663 811.8526 818.7225 832.8009 867.9640 886.6106 915.8156 954.3542 958.6727 960.4850 983.7948 989.6060 991.9812 1020.0607 1058.7077 1067.8014 1108.9425 1162.1744 1169.1578 1174.5781 1180.8597 1191.5726 1198.3677 1205.5010 1239.0583 1276.5438 1301.7675 1328.2007 1352.0867 1357.5402 1380.3063 1396.0768 1434.3194 1449.0514 1462.9994 1473.8523 1485.4802 1595.9185 1603.7050 1609.7894 1619.3737 2988.2318 3025.9940 3052.0886 3125.0125 3127.0008 3134.9191 3143.7180 3146.7001 3160.8475 3163.2561 3543.8904 3554.3057
redmass: 4.9211 3.6247 3.9214 4.6600 4.8248 3.1025 4.1955 4.1284 3.4280 4.4326 1.3735 2.0502 1.6974 4.5428 3.6535 3.2902 4.9244 5.1886 3.6714 4.9237 6.2340 4.3777 4.7619 5.0462 1.8528 1.4671 1.7726 3.6345 4.6254 3.7104 1.5825 1.4057 1.4331 2.8907 3.8175 2.0588 1.3643 1.6987 2.1983 2.4765 2.7048 1.7931 1.3347 1.1474 1.2565 1.6260 2.2200 1.3156 1.5360 2.2521 1.8183 2.0582 1.3064 1.1962 1.3711 4.3721 3.1194 2.4734 2.8240 3.0051 1.2751 2.5034 6.9522 7.6883 7.2658 7.3235 1.0607 1.0837 1.1026 1.0855 1.0861 1.0895 1.0921 1.0949 1.0982 1.1003 1.0662 1.0661
irintensity: 1.2983 3.9627 0.6599 0.8804 0.2524 1.5592 0.6296 6.6064 11.6527 1.9766 132.7252 48.9175 96.6975 2.7842 3.4349 10.2568 2.1586 3.8499 6.2212 10.9255 4.0587 12.0070 16.1842 3.6270 7.2451 134.6165 14.6875 13.3523 26.7156 2.0328 1.9865 1.9712 2.0998 88.7808 46.6846 13.6102 0.6391 5.3007 10.7724 3.3103 5.0222 1.0058 14.8572 8.9363 7.5358 9.9893 8.0396 15.2941 8.1248 3.7417 3.6727 0.7473 11.0383 30.5941 39.8188 1.8780 3.2705 27.2558 14.7284 0.7472 7.8751 0.6407 0.5561 8.9152 7.1368 7.6454 15.1500 11.6520 9.1667 3.8152 4.6826 2.8860 4.8508 26.9431 25.3043 31.0843 7.9566 9.9588
temp: 298.150 k
press: 1.00000 atm
elementType: 8 8 6 6 6 6 6 6 6 6 6 6 6 6 6 6 1 1 1 1 1 1 1 1 1 1 1 1
symmnumber: 1
zpe: 578863.8 jmol-1
zpe.correction: 0.220478 hartree
zpe.thermalcorrener: 0.233589 hartree
zpe.thermalcorrenthalpy: 0.234533 hartree
zpe.thermalcorrgfe: 0.180973 hartree
zpe.sumelectzpe: -690.014367 hartree
zpe.sumelectthermal: -690.001256 hartree
zpe.sumelectthermalent: -690.000312 hartree
zpe.sumelectthermalfe: -690.053871 hartree
dipole: -2.3360 1.4949 1.3407
dipole: 3.0804
quadrupole: -94.3299 -89.4245 -91.2992
quadrupole: 3.7341 3.7268 0.8367
quadrupole: -2.6454 2.2600 0.3854 3.7341 3.7268 0.8367
hfenergy: -690.2348445 hartree
pointgroup: C01 [X(C14H12O2)]
dipole: 0.8852431 -0.5530786 0.6158321 debye
polarizability: 232.4797673|7.8939426|162.4012755|2.8398108|-18.0573754|80.3874599 unknown
InChI: InChI=1S/C14H12O2/c15-8-9-4-3-7-11-10-5-1-2-6-12(10)14(16)13(9)11/h1-7,14-16H,8H2
charge 0 multiplicity 1
28 atoms
O  -0.212011 2.588813 0.275739
O  -4.457484 1.323435 -0.122322
C  0.069797 1.392604 -0.550982
C  -0.854888 0.197297 -0.282352
C  -0.078904 -0.958812 0.025907
C  1.460107 0.796035 -0.324556
C  1.354901 -0.587733 0.00049
C  -2.26321 0.143834 -0.327143
C  -0.704915 -2.190854 0.303658
C  2.709702 1.431212 -0.395387
C  2.515092 -1.351378 0.246011
C  -2.887564 -1.100948 -0.035178
C  -3.101374 1.365897 -0.692499
C  -2.119413 -2.247914 0.273551
C  3.877176 0.665312 -0.140923
C  3.77744 -0.713066 0.172059
H  -0.045722 1.777913 -1.580727
H  -0.118423 -3.086002 0.53831
H  2.781742 2.49745 -0.636376
H  2.450685 -2.417327 0.491885
H  -3.981073 -1.1542 -0.064425
H  -2.568149 2.291662 -0.400733
H  -3.277731 1.398279 -1.782798
H  -2.628207 -3.194665 0.48773
H  4.862666 1.141618 -0.18915
H  -0.047685 2.348942 1.224343
H  4.688687 -1.291517 0.361678
H  -4.384338 1.337711 0.866092
