program: Gaussian 09
title: 000252733
version: EM64L-G09RevD.01
frameworkgroup: C1[X(C11H7BrO2)]
method: RPBEPBE
basis: SDD
operation: Freq
keyword: #p
keyword: freq=noraman
keyword: PBEPBE/SDD
title: #p freq=noraman PBEPBE/SDD
converged: NO YES NO NO
title: Mulliken charges:
elementType: Br O O C C C C C C C C C C C H H H H H H H
charge: 0.017390 -0.444999 -0.265701 0.210243 0.426504 0.105658 -0.278531 -0.430588 -0.425714 -0.326710 -0.236108 -0.243010 -0.214102 0.123816 0.322983 0.247466 0.245955 0.285608 0.237997 0.255380 0.386463
chargesum: 0.00000
title: Mulliken charges with hydrogens summed into heavy atoms:
elementType: Br O O C C C C C C C C C C C
charge: 0.017390 -0.058536 -0.265701 0.210243 0.426504 0.105658 0.044453 -0.183123 -0.179759 -0.041102 0.001889 -0.243010 0.041278 0.123816
polarizability: 2.27616039e+02 -8.04559596e+00 1.65235335e+02 4.41891846e-02 3.04045150e-02 5.10650515e+01
1716.lowfreq: -8.5354 -5.6819 -0.0004 -0.0003 0.0005 3.4330 42.8616 70.0178 114.0263
frequency: 42.8590 70.0152 114.0235 131.3191 191.4455 241.3876 259.6238 267.9369 344.4691 386.1658 402.2886 470.5222 490.3130 515.8324 552.9691 581.0415 584.0351 608.5873 638.8477 693.3312 729.3949 763.4866 799.9305 814.2766 834.2942 855.4191 944.2192 951.2414 957.5312 974.2947 1002.0207 1061.6510 1068.8341 1088.1176 1155.1670 1173.3623 1200.7478 1237.6278 1269.3542 1308.5944 1338.0309 1395.0235 1413.3564 1431.6215 1441.2742 1501.5021 1575.8280 1581.6650 1613.1867 1634.8565 3129.7277 3136.3255 3158.6590 3175.8504 3184.4703 3185.4889 3531.7607
redmass: 12.7908 5.6453 13.3809 5.4226 3.9012 10.6273 8.1648 5.1761 7.3441 7.4670 3.3254 5.2920 2.8661 3.6688 6.4915 6.7715 1.3662 5.6185 2.9345 5.6385 5.3584 1.7607 1.5850 6.3871 5.5149 1.8761 1.4061 1.3611 7.0338 1.3984 1.3954 2.2872 3.1034 2.1179 1.3015 1.3523 1.5208 1.8563 1.5782 1.9537 3.0092 4.3857 6.1965 2.1318 2.9505 4.5785 6.7938 6.1230 6.7483 7.9168 1.0886 1.0895 1.0942 1.0962 1.0930 1.0952 1.0642
irintensity: 1.0833 0.0069 0.2817 1.5147 0.5203 2.0175 2.9324 1.2180 6.3171 0.8997 9.4700 7.1071 0.7581 0.3912 15.4453 36.8348 154.5578 26.4223 14.4238 6.5517 26.1913 20.8197 8.6609 49.7327 10.0385 69.2749 18.0773 0.0294 84.8992 2.1157 2.9308 237.4926 164.1299 32.1953 29.2165 21.5685 21.1101 4.1930 12.4387 77.3573 8.4666 6.5337 7.1911 31.5124 14.8050 64.3835 45.3304 68.9664 41.7789 186.9225 2.7094 7.0442 19.3756 5.5602 20.9289 6.3979 58.6343
temp: 298.150 k
press: 1.00000 atm
elementType: 35 8 8 6 6 6 6 6 6 6 6 6 6 6 1 1 1 1 1 1 1
symmnumber: 1
zpe: 390013.7 jmol-1
zpe.correction: 0.148548 hartree
zpe.thermalcorrener: 0.159962 hartree
zpe.thermalcorrenthalpy: 0.160906 hartree
zpe.thermalcorrgfe: 0.109445 hartree
zpe.sumelectzpe: -586.337104 hartree
zpe.sumelectthermal: -586.325690 hartree
zpe.sumelectthermalent: -586.324746 hartree
zpe.sumelectthermalfe: -586.376208 hartree
dipole: -2.7451 2.7449 0.0018
dipole: 3.8820
quadrupole: -80.8088 -76.9867 -93.7081
quadrupole: 3.5544 0.0132 -0.0109
quadrupole: 3.0257 6.8478 -9.8736 3.5544 0.0132 -0.0109
hfenergy: -586.4856525 hartree
pointgroup: C01 [X(C11H7Br1O2)]
dipole: 0.6840378 1.3647357 -0.0468771 debye
dipolederiv: -0.495842 -0.3218158 0.0338225 -0.4727814 -0.4060126 0.0345148 0.0338219 0.0233998 -0.036111 -1.4930408 0.3404648 0.0845878 0.2599871 -0.3108135 -0.0198645 0.0878822 -0.0273172 -0.4352984 -0.6670119 -0.0326582 0.027619 0.0225652 -1.0364066 -0.0025192 0.0271994 -0.0017185 -0.3262377 0.3044471 -0.0934955 -0.0221899 0.3759988 0.0267221 -0.0283392 -0.0210632 0.0075226 0.0170121 -0.0707621 -0.0278022 0.0097571 -0.1586368 -0.2561812 0.0107908 0.0094608 0.0009321 0.0587022 -0.1752106 0.0917727 0.0136927 0.3808267 -0.6637983 -0.0317276 0.0146892 -0.0095576 -0.0060854 -0.5974339 -0.1265827 0.0390571 -0.2353408 -0.1711314 0.0174187 0.038632 0.0094594 -0.0800107 0.2970542 -0.0784471 -0.0327832 0.1206498 0.1619205 -0.0079997 -0.0318026 0.0068895 -0.1351608 0.1600316 0.1030366 -0.0237431 -0.1011871 0.1097754 0.0084309 -0.0243503 -0.0068718 -0.161452 -0.053938 0.0183398 -0.0031065 -0.3492395 0.222267 0.0275233 -0.0050177 -0.0001776 -0.0974067 -0.3131832 0.2269476 0.0121188 0.2970258 -0.0208262 -0.0214854 0.0121239 -0.0161288 -0.1685502 0.8556685 0.6233388 -0.0728334 0.7827675 0.8160848 -0.056357 -0.0729989 -0.0447151 -0.1278415 -0.1460059 -0.3006276 0.0031536 -0.259429 -0.302816 0.0189347 0.0033736 0.0220918 -0.0934483 1.7227544 -0.3781636 -0.1197069 -0.5832209 1.5915194 0.0486739 -0.1219673 0.0361665 0.240394 0.2104086 0.0128118 -0.0034966 -0.0721899 0.0826445 0.0052466 -0.0036546 -0.0010868 0.1657182 0.0668579 0.0982069 0.0066119 0.0231452 -0.0703143 -0.0025797 0.0062527 -0.0081107 0.1507328 0.0528162 -0.0097279 0.0077351 0.0557064 -0.0913607 -0.0049174 0.0078422 -0.0001932 0.1566412 -0.0024322 0.0127933 0.0119077 -0.0007295 0.1264773 -0.0000057 0.0117966 -0.000846 0.156617 -0.0031678 -0.1077435 0.0118257 -0.091684 -0.0328548 0.0059146 0.0119821 0.0071237 0.1614122 -0.0524056 0.0393741 0.0162062 0.0216233 0.10216 -0.0018087 0.0162895 -0.0030714 0.1618249 0.4003957 -0.0900223 -0.0002355 -0.0158569 0.1229448 0.0001559 -0.0004916 0.0062092 0.3985481 unknown
polarizability: 215.7266413|25.0404859|176.2049816|-12.2944496|-1.4013967|51.9848027 unknown
InChI: InChI=1S/C11H7BrO2/c12-8-5-4-7-2-1-3-9(11(13)14)10(7)6-8/h1-6,13H
charge 0 multiplicity 1
21 atoms
Br -3.7778 -2.09795 0.228625
O  3.279286 -1.594927 -0.309219
O  1.242082 -2.66935 -0.152418
C  -0.106086 0.045799 -0.040482
C  -0.556326 1.426559 -0.002017
C  1.321086 -0.20219 -0.148202
C  -1.09302 -0.996249 0.029729
C  0.394998 2.494038 -0.068273
C  -1.957877 1.71002 0.102855
C  2.218284 0.881759 -0.210559
C  1.761679 2.227535 -0.17056
C  -2.441625 -0.662506 0.13135
C  -2.902128 0.68656 0.169752
C  1.874682 -1.582597 -0.195527
H  -0.76637 -2.037255 0.002524
H  0.03097 3.527853 -0.037257
H  -2.28524 2.755555 0.130491
H  3.287047 0.669792 -0.291315
H  2.486156 3.046264 -0.220673
H  -3.970107 0.904996 0.250269
H  3.57491 -2.544108 -0.337195
