program: Gaussian 09
title: 000252722
version: EM64L-G09RevD.01
frameworkgroup: C1[X(C20H14O2)]
method: RPBEPBE
basis: SDD
operation: Freq
keyword: #pfreq=noraman
keyword: PBEPBE/SDD
title: #p freq=noraman PBEPBE/SDD
converged: YES YES NO NO
title: Mulliken charges:
elementType: O O C C C C C C C C C C C C C C C C C C C C H H H H H H H H H H H H H H
charge: -0.294920 -0.269218 0.072684 0.232380 0.447935 0.199584 0.226641 0.394451 -0.483962 -0.432006 -0.470300 0.057298 -0.423063 -0.484699 -0.405822 -0.441571 -0.351486 -0.261947 -0.260033 -0.251959 0.174988 -0.500352 0.240214 0.307928 0.243526 0.286633 0.239335 0.275582 0.241272 0.281422 0.234032 0.229830 0.231145 0.241758 0.230877 0.241824
chargesum: 0.00000
title: Mulliken charges with hydrogens summed into heavy atoms:
elementType: O O C C C C C C C C C C C C C C C C C C C C
charge: -0.294920 -0.269218 0.072684 0.232380 0.447935 0.199584 0.226641 0.394451 -0.243748 -0.124078 -0.226774 0.057298 -0.136429 -0.245364 -0.130241 -0.200299 -0.070064 -0.027915 -0.030203 -0.020814 0.174988 0.214106
polarizability: 3.97460769e+02 2.10735013e+00 2.54676632e+02 9.37551268e-01 -1.08378715e+00 9.66917535e+01
1716.lowfreq: -6.0622 -3.0283 -0.0008 -0.0003 0.0003 5.6382 24.3319 41.0987 82.2259
frequency: 24.3000 41.0881 82.2212 100.6174 107.7351 117.7082 148.2756 160.4870 185.6154 241.1246 248.0994 260.3178 279.2867 317.4759 343.7382 385.4325 407.7433 424.6694 441.2297 480.8310 492.9526 511.4907 518.1213 536.7612 559.2925 584.2519 588.6284 630.1855 672.8050 680.3781 702.3744 726.7008 743.6790 757.8945 760.8497 777.6684 790.9686 813.1373 823.6591 835.0948 847.6952 870.8125 887.4432 924.2222 947.6098 968.0783 978.5211 988.4756 991.5818 1000.3810 1007.6379 1014.4678 1043.0108 1087.8930 1099.6014 1114.2180 1133.1698 1144.6541 1164.0339 1169.8566 1178.9956 1199.2856 1227.1807 1233.7340 1239.1003 1247.1466 1252.8468 1298.1449 1348.6856 1380.8539 1391.6574 1397.3978 1414.1789 1419.3690 1422.6679 1428.8844 1449.1875 1451.0011 1464.6378 1495.4828 1501.9664 1532.2753 1569.5976 1585.2460 1607.4546 1611.7875 1614.1177 1630.4829 3002.5412 3103.2234 3121.1461 3122.7317 3128.0554 3134.4194 3143.0008 3144.9843 3146.6792 3156.1532 3168.9102 3179.7658 3189.3550 3189.9735
redmass: 5.7617 5.8272 4.4815 3.0532 2.2848 1.7130 3.7404 4.1861 4.4479 4.8056 5.1866 4.9612 4.6689 4.7677 4.6698 8.4623 5.3282 3.8236 3.7971 4.7674 5.3015 3.4381 6.4376 4.6931 6.8285 3.3568 3.7949 6.9362 3.8908 5.8623 5.8024 5.2006 5.1302 2.2227 1.3449 6.0818 2.1798 4.5203 1.4483 2.8389 5.2319 1.5889 1.5799 7.0728 1.3933 1.3656 1.4866 1.4643 3.1388 4.0341 1.3539 1.4886 2.2173 4.0875 2.1084 1.2619 1.8979 1.4421 1.2794 1.2758 1.1595 1.5753 1.7779 2.3902 2.3946 1.8747 1.6945 1.8510 4.5610 3.5344 5.0586 3.4277 2.6251 2.6904 1.2871 2.3607 2.2818 1.0499 1.0522 3.4788 3.7785 4.7738 7.5425 6.2330 6.6912 6.0223 8.4169 6.7937 1.0295 1.1043 1.0867 1.0863 1.0905 1.0895 1.0882 1.1046 1.0987 1.0956 1.0972 1.0927 1.0956 1.0947
irintensity: 1.3122 0.0651 0.1637 0.6213 1.1601 0.0952 3.9353 8.2315 0.3787 0.6159 8.5594 1.6316 0.7136 8.7412 12.4428 0.3545 2.5128 5.6714 0.9304 1.5083 4.5008 10.1150 2.7703 2.2244 0.0842 0.1236 14.7535 13.3286 12.7029 3.0495 0.5244 3.0965 5.8272 14.8276 71.7058 18.8451 9.9403 2.6784 10.2846 16.3384 1.9105 41.5708 56.0505 5.2486 1.1943 3.4758 1.1051 1.7376 21.0289 42.0415 0.6341 2.8895 37.2895 271.9302 14.3569 0.0842 41.1184 70.4054 5.1461 6.4612 1.5673 38.7214 17.9852 26.7723 264.6471 10.0992 34.0355 2.4371 2.1900 10.9837 0.9448 2.8371 0.4706 3.7355 29.1839 1.3547 5.9339 13.7220 16.3076 21.4968 3.0573 34.8776 19.2029 50.6841 7.7435 4.6306 119.3506 9.1653 54.2851 27.2303 0.9739 3.1690 16.5686 9.0824 9.4038 20.9039 33.3657 40.0444 7.5884 9.3320 8.9793 16.9875
temp: 298.150 k
press: 1.00000 atm
elementType: 8 8 6 6 6 6 6 6 6 6 6 6 6 6 6 6 6 6 6 6 6 6 1 1 1 1 1 1 1 1 1 1 1 1 1 1
symmnumber: 1
zpe: 730993.4 jmol-1
zpe.correction: 0.278421 hartree
zpe.thermalcorrener: 0.295466 hartree
zpe.thermalcorrenthalpy: 0.296410 hartree
zpe.thermalcorrgfe: 0.233080 hartree
zpe.sumelectzpe: -919.523357 hartree
zpe.sumelectthermal: -919.506312 hartree
zpe.sumelectthermalent: -919.505367 hartree
zpe.sumelectthermalfe: -919.568698 hartree
dipole: -0.5696 -1.4931 -0.3384
dipole: 1.6335
quadrupole: -100.6206 -114.2358 -132.4998
quadrupole: -6.4236 -0.2396 -1.6894
quadrupole: 15.1648 1.5496 -16.7144 -6.4236 -0.2396 -1.6894
hfenergy: -919.8017779 hartree
pointgroup: C01 [X(C20H14O2)]
dipole: 0.2220526 0.5993413 -0.0670784 debye
polarizability: 396.2650433|3.1606035|251.5415035|-18.9251061|21.8695712|101.0226082 unknown
InChI: InChI=1S/C20H14O2/c1-22-20(21)18-8-4-7-17-16(18)12-11-14-10-9-13-5-2-3-6-15(13)19(14)17/h2-12H,1H3
charge 0 multiplicity 1
36 atoms
O  -5.003193 0.661778 0.560619
O  -4.207517 -1.511787 0.597697
C  1.106906 -0.422738 -0.103889
C  -0.154415 0.322778 -0.053172
C  1.035069 -1.83642 -0.326894
C  2.435229 0.175951 0.057697
C  -1.41551 -0.388757 0.097801
C  3.604907 -0.601034 -0.306307
C  -0.232753 -2.50994 -0.242792
C  -1.406247 -1.830991 0.033287
C  2.22253 -2.594761 -0.632541
C  -2.642869 0.373956 0.229026
C  -0.204623 1.738957 -0.260274
C  3.460497 -1.983261 -0.688058
C  2.671831 1.460331 0.654501
C  4.908673 -0.019083 -0.215685
C  -2.615327 1.779059 0.111404
C  -1.405935 2.452513 -0.180031
C  3.961103 1.996849 0.765256
C  5.091282 1.271482 0.289438
C  -3.964928 -0.283042 0.470326
C  -6.346995 0.096825 0.811554
H  -0.249943 -3.598291 -0.375676
H  -2.348731 -2.365896 0.157273
H  2.115383 -3.665546 -0.840631
H  0.704593 2.269155 -0.551161
H  4.356809 -2.549303 -0.966806
H  1.838728 2.011487 1.096765
H  5.772359 -0.62093 -0.522919
H  -3.550197 2.334933 0.208297
H  -1.413374 3.532997 -0.356621
H  4.101702 2.973153 1.242122
H  6.09442 1.70527 0.361015
H  -6.631775 -0.593668 -0.000204
H  -7.014823 0.96935 0.843459
H  -6.361464 -0.450873 1.769027
