program: Gaussian 09
title: 000252719
version: EM64L-G09RevD.01
frameworkgroup: C1[X(C19H24O6S2)]
method: RPBEPBE
basis: SDD
operation: Freq
keyword: #p
keyword: freq=noraman
keyword: PBEPBE/SDD
title: #p freq=noraman PBEPBE/SDD
converged: NO YES NO NO
title: Mulliken charges:
elementType: S S O O O O O O C C C C C C C C C C C C C C C C C C C H H H H H H H H H H H H H H H H H H H H H H H H
charge: 1.070482 1.076839 -0.420691 -0.437499 -0.494905 -0.571384 -0.494529 -0.567165 -0.117281 -0.392714 0.371220 -0.340506 -0.353969 0.504800 0.261037 -0.362666 -0.427183 -0.407563 -0.402106 -0.876598 -0.269245 -0.226281 -0.256279 -0.241243 -0.245163 -0.758376 -0.759649 0.237094 0.241392 0.260980 0.256204 0.272860 0.255247 0.231078 0.225816 0.231055 0.230547 0.223421 0.232431 0.272405 0.226028 0.225737 0.227678 0.227287 0.230838 0.286156 0.350721 0.277649 0.279184 0.282730 0.354076
chargesum: 0.00000
title: Mulliken charges with hydrogens summed into heavy atoms:
elementType: S S O O O O O O C C C C C C C C C C C C C C C C C C C
charge: 1.070482 1.076839 -0.420691 -0.437499 -0.494905 -0.571384 -0.494529 -0.567165 0.119814 -0.151322 0.371220 0.176678 0.174138 0.504800 0.261037 -0.131588 -0.201367 -0.176508 -0.171558 -0.148342 -0.043216 -0.000544 -0.028601 -0.013956 -0.014325 0.156150 0.156340
polarizability: 2.95773437e+02 -4.01085270e+00 3.08357163e+02 -6.32179241e+00 -1.18835746e+01 2.37992456e+02
1716.lowfreq: -8.1679 -0.0019 -0.0010 -0.0005 3.1408 9.3074 21.7372 30.9749 31.7179
frequency: 21.5405 30.8974 31.6848 46.2908 48.6987 58.4371 62.9225 75.4677 79.0072 94.3224 100.9408 111.1814 131.0529 141.2522 158.8651 170.0464 187.6012 191.1969 200.0009 205.5215 231.4959 235.3139 237.3973 239.7511 244.3708 251.6054 270.7332 289.9104 294.6139 306.0372 326.6928 343.5363 351.0244 392.4718 398.6432 404.3079 416.8021 444.2407 447.3014 462.7619 488.1562 527.4612 534.8353 566.5257 595.0923 598.5273 600.9382 615.6599 621.5439 655.9681 705.8319 735.3064 739.5732 762.9678 787.3606 811.3106 826.3942 832.3154 844.8819 853.1739 858.4306 872.8514 884.8621 916.5678 920.7891 921.0123 923.8720 932.0211 948.5548 977.7066 986.7052 990.8655 992.6605 995.6442 1005.8633 1009.5490 1025.4578 1032.7834 1051.9035 1054.3065 1054.6940 1065.6068 1077.1031 1092.2574 1111.6269 1119.0696 1173.0676 1174.7064 1179.0603 1189.3464 1193.9151 1200.8443 1223.0544 1231.7719 1250.1766 1264.6654 1293.3141 1310.4328 1320.6310 1328.6150 1331.1445 1347.8934 1355.0699 1367.9523 1377.0001 1383.1578 1404.4997 1415.3771 1418.6749 1433.7360 1436.4650 1439.9719 1440.3562 1462.9021 1474.0305 1475.7246 1480.6601 1483.4400 1491.1220 1585.5457 1591.3880 1610.6880 1613.5815 2971.0022 2989.3085 2996.6828 3000.5512 3004.2128 3006.6870 3036.5260 3050.1723 3078.2293 3083.5355 3085.5536 3115.4775 3116.2889 3117.9230 3124.6360 3133.5632 3139.9475 3144.6911 3147.6239 3153.3482 3160.5597 3163.7691 3183.6659 3185.5066
redmass: 6.9320 6.4401 4.4422 4.7746 4.1846 6.0324 5.5889 5.2958 6.7216 7.6207 7.1915 8.5898 6.4476 4.9588 4.1019 3.7203 2.4880 1.3962 2.5874 2.9443 3.5436 1.3228 2.8051 2.8937 1.3972 3.9709 4.1339 4.3423 5.6881 6.1969 4.9981 9.1890 8.5987 4.5040 3.2966 2.8465 3.9496 3.2943 5.0476 3.6890 3.8376 4.8198 4.6180 5.1023 7.6033 8.9765 4.9794 6.0481 5.7485 4.5452 1.7909 2.1213 2.3082 1.6168 3.6470 3.0571 10.1710 11.2887 3.9263 1.3060 2.5917 1.6016 2.7865 2.6554 3.9448 2.5921 3.6746 1.7828 1.4729 1.3938 1.3360 5.6188 1.6263 1.3150 1.3573 1.3291 2.1885 2.1855 1.9777 1.6802 1.6013 1.6453 1.6906 2.1613 2.0508 3.0285 1.0671 1.2859 1.4546 1.1413 1.6219 1.5346 2.3205 1.2462 1.2973 1.4755 1.4197 1.4824 1.3841 1.1318 1.1284 1.2862 1.2837 1.2443 4.6408 4.8974 1.2426 1.0428 1.0428 2.0456 1.0565 1.2095 1.6811 1.0742 1.0807 1.1590 2.1667 1.9630 1.1594 6.3002 5.8684 6.0526 6.0713 1.0383 1.0749 1.0292 1.0592 1.0290 1.0614 1.0832 1.0965 1.1063 1.0982 1.1041 1.0876 1.0862 1.0858 1.0881 1.0902 1.0935 1.0955 1.1051 1.1062 1.1007 1.1014 1.1072 1.1073
irintensity: 0.0095 0.1657 0.0279 0.0636 0.3596 0.4537 0.5134 0.4114 0.0701 13.6257 4.8736 5.9180 3.8915 11.2103 0.6950 3.7816 4.9673 0.8905 1.1359 3.3564 3.7454 1.9396 2.4096 1.4137 2.8038 4.3330 0.0361 6.9521 12.0855 39.8004 4.8916 31.5150 1.0255 10.0409 6.0015 0.4646 7.6186 38.3790 66.7609 18.4683 3.1814 14.9258 0.0695 13.9889 10.1041 40.2834 43.5222 39.2853 23.9327 8.4093 46.6251 30.3981 24.7438 45.4521 5.2154 16.5063 49.0776 84.6326 11.1887 2.2255 7.8899 3.9719 45.2941 19.6076 24.9862 53.8328 105.4464 1.4545 0.5711 0.1742 0.0786 1.9498 1.5874 0.0750 22.7989 34.7582 13.2123 12.2577 7.6297 24.2436 125.0906 1.6248 7.4819 9.6513 3.6002 3.2492 0.1105 1.5281 0.3761 1.1361 4.5656 3.2168 0.7871 9.3767 0.7142 3.1518 4.2819 2.1937 2.9808 11.4298 11.0512 1.3328 2.1122 2.4915 1.1955 2.7256 11.2849 5.5934 1.5406 2.3403 5.7946 12.1712 11.1603 29.5778 21.6916 12.2364 16.2953 21.7306 14.6721 0.4081 2.2982 10.8295 2.3049 23.6796 5.3075 34.0817 11.2866 54.2085 21.5481 11.6473 9.9246 13.9085 20.0276 18.1683 6.0877 15.0186 8.6495 4.3234 10.3131 25.8608 37.5402 26.4573 36.2986 33.8422 25.8280 0.3917 0.4778
temp: 298.150 k
press: 1.00000 atm
elementType: 16 16 8 8 8 8 8 8 6 6 6 6 6 6 6 6 6 6 6 6 6 6 6 6 6 6 6 1 1 1 1 1 1 1 1 1 1 1 1 1 1 1 1 1 1 1 1 1 1 1 1
symmnumber: 1
zpe: 1036001.8 jmol-1
zpe.correction: 0.394592 hartree
zpe.thermalcorrener: 0.423760 hartree
zpe.thermalcorrenthalpy: 0.424705 hartree
zpe.thermalcorrgfe: 0.333672 hartree
zpe.sumelectzpe: -1983.510653 hartree
zpe.sumelectthermal: -1983.481484 hartree
zpe.sumelectthermalent: -1983.480540 hartree
zpe.sumelectthermalfe: -1983.571573 hartree
dipole: 0.9029 -0.0619 0.2816
dipole: 0.9478
quadrupole: -166.0923 -197.2940 -161.2360
quadrupole: 5.5256 0.7085 -10.0232
quadrupole: 8.7818 -22.4199 13.6381 5.5256 0.7085 -10.0232
hfenergy: -1983.9052448 hartree
pointgroup: C01 [X(C19H24O6S2)]
dipole: 0.352732 0.0757237 0.0943873 debye
polarizability: 298.5777771|-7.2836798|306.1358299|-6.4442616|-9.5072366|237.4094501 unknown
InChI: InChI=1S/C19H24O6S2/c1-15-9-7-8-12-18(15)19(16-10-5-4-6-11-16)17(13-24-26(2,20)21)14-25-27(3,22)23/h4-12,17,19H,13-14H2,1-3H3
charge 0 multiplicity 1
51 atoms
S  -4.290016 0.796604 0.031267
S  -2.229953 -3.19987 0.391583
O  -2.627951 0.856229 -0.835082
O  -0.900922 -1.871558 0.450116
O  -4.965099 2.261091 0.090902
O  -4.098325 -0.035543 1.418943
O  -1.549028 -4.661465 0.341867
O  -3.303088 -2.786341 -0.760524
C  -0.291133 0.252259 -0.605467
C  1.029058 0.433432 0.224895
C  2.20101 -0.326264 -0.433273
C  -1.46892 0.976193 0.082632
C  -0.629646 -1.230931 -0.864522
C  1.40886 1.904135 0.470756
C  2.798631 -1.46477 0.190026
C  2.693872 0.112435 -1.689124
C  2.049978 2.248503 1.688687
C  1.195435 2.931423 -0.484974
C  3.864628 -2.1227 -0.478103
C  2.333478 -1.993057 1.538804
C  3.751634 -0.55375 -2.341634
C  2.47116 3.571399 1.946133
C  1.612721 4.257151 -0.232269
C  4.342057 -1.68257 -1.731292
C  2.255283 4.584023 0.9833
C  -5.118895 -0.280059 -1.286738
C  -2.923773 -2.838135 2.115544
H  -0.145819 0.696467 -1.611251
H  0.83906 -0.021923 1.213289
H  -1.246113 2.042872 0.245145
H  -1.701206 0.484952 1.047681
H  -1.536187 -1.29646 -1.495269
H  0.213136 -1.753215 -1.347908
H  2.257953 1.002028 -2.158568
H  2.223809 1.469565 2.441927
H  0.689132 2.711631 -1.432871
H  4.324147 -2.997835 -0.002953
H  2.496657 -1.254418 2.347562
H  2.890057 -2.906268 1.80963
H  1.256582 -2.242791 1.52682
H  4.114453 -0.193284 -3.310561
H  2.963547 3.812163 2.895056
H  1.432627 5.034915 -0.983029
H  5.165718 -2.212676 -2.222378
H  2.577836 5.612439 1.179543
H  -4.996333 0.265183 -2.232007
H  -4.572617 -1.236169 -1.259948
H  -6.171393 -0.365846 -0.982152
H  -3.669949 -3.622653 2.30491
H  -2.06529 -2.900911 2.797516
H  -3.357067 -1.827226 2.045364
