program: Gaussian 09
title: 000252715
version: EM64L-G09RevD.01
frameworkgroup: C1[X(C19H15FO2)]
method: RPBEPBE
basis: SDD
operation: Freq
keyword: #p
keyword: freq=noraman
keyword: PBEPBE/SDD
title: #p freq=noraman PBEPBE/SDD
converged: YES YES NO NO
title: Mulliken charges:
elementType: F O O C C C C C C C C C C C C C C C C C C C H H H H H H H H H H H H H H H
charge: -0.210776 -0.440333 -0.249848 -0.332879 0.406324 0.391041 0.160356 -0.756269 0.447149 -0.569705 0.065129 -0.378147 -0.346638 -0.652753 0.346823 -0.432872 -0.330395 -0.253720 -0.284152 -0.245231 -0.234221 0.079122 0.266397 0.226870 0.218510 0.247809 0.276126 0.251909 0.236787 0.263170 0.240831 0.281535 0.233178 0.227859 0.229408 0.236606 0.384999
chargesum: 0.00000
title: Mulliken charges with hydrogens summed into heavy atoms:
elementType: F O O C C C C C C C C C C C C C C C C C C C
charge: -0.210776 -0.055334 -0.249848 -0.066482 0.406324 0.391041 0.160356 -0.063079 0.447149 -0.293579 0.065129 -0.126238 -0.109851 -0.389582 0.346823 -0.192041 -0.048861 -0.020542 -0.056293 -0.015822 0.002384 0.079122
polarizability: 2.77895534e+02 -4.56230280e+01 1.95770499e+02 -6.51735352e+00 -4.81430534e+00 1.62013715e+02
1716.lowfreq: -6.8427 -2.8143 -0.0011 -0.0010 -0.0005 8.8028 22.5923 28.6076 45.4194
frequency: 22.2140 28.4717 45.4162 58.9450 95.6531 119.8295 131.1572 156.9091 180.2809 199.8033 231.6885 262.8364 270.7882 295.2634 301.8196 311.8584 371.6885 384.9506 414.1365 421.1757 446.3312 466.5794 489.6573 521.1740 522.5387 527.4532 581.1165 591.3464 603.4529 606.9431 628.1462 631.4598 657.0036 694.4697 720.5653 737.1661 757.4159 780.5492 791.3566 795.0478 801.7973 850.8746 861.1795 887.9737 896.9732 902.7018 928.5924 962.1902 978.0159 990.0615 991.2324 995.2777 1004.9591 1010.1916 1035.9436 1045.8632 1054.0321 1079.7138 1116.7820 1120.1920 1155.4902 1163.1181 1179.3358 1182.8046 1207.0954 1211.8245 1251.5391 1260.7913 1281.3582 1287.9821 1307.6621 1339.3817 1359.2689 1380.4307 1389.3577 1403.6710 1419.8477 1433.6630 1435.3845 1449.4760 1472.9648 1477.7017 1493.6587 1519.5740 1576.4905 1591.8334 1607.1069 1610.6533 1633.6236 1634.8595 2981.8863 3042.4476 3080.3704 3084.5160 3123.3300 3133.5614 3135.9508 3153.9048 3154.0996 3160.8887 3163.5176 3168.9464 3169.4317 3183.3341 3526.3971
redmass: 7.2504 6.0784 8.9282 6.0216 4.1239 4.4036 4.8223 4.8014 4.5097 4.8043 4.9502 2.9650 3.6281 1.5104 3.8769 3.5489 4.6440 7.8366 4.3707 4.5366 3.3831 5.2151 4.1084 3.6510 6.2507 4.5050 4.1003 1.2778 3.9134 4.3809 5.7796 4.0011 3.0248 3.7503 4.0978 3.3889 1.3750 2.7425 2.3108 2.1418 3.6904 1.3921 4.3128 1.4225 1.8355 1.4413 3.7947 1.4009 1.4254 1.3621 4.0763 4.3256 1.3680 2.1760 2.2155 2.7855 2.3106 1.7834 2.1020 1.7739 1.3922 1.7750 1.1305 1.0767 2.0035 1.5314 1.9868 1.9506 1.6223 1.8516 2.2240 1.6240 2.2664 4.7306 1.2423 4.0935 4.1299 2.3446 2.4909 2.7487 1.0517 2.2178 1.1243 3.9877 6.3226 7.2772 6.2114 6.3721 6.7428 7.9702 1.0356 1.0829 1.0995 1.0988 1.0860 1.0865 1.0895 1.0946 1.0921 1.0914 1.0931 1.0984 1.0946 1.0967 1.0641
irintensity: 0.1879 0.3382 2.1189 0.0196 0.1482 0.2426 0.5182 0.0767 0.6439 1.6035 1.5504 0.2998 0.3186 0.1559 1.1805 0.5280 3.4220 3.6252 7.3098 5.6602 16.0190 5.7828 2.3442 0.3844 5.1847 5.0478 23.2910 91.3711 11.8948 25.4285 5.4746 6.9510 0.4117 71.6030 2.5822 6.6620 40.9505 24.4652 29.4416 18.0366 2.9360 20.7249 1.9170 5.4782 29.2309 8.8221 38.8313 2.6378 10.1715 5.3805 40.4137 212.4067 1.9458 29.7587 2.6225 11.0610 23.5566 3.1750 73.7297 12.7620 15.2051 54.4044 2.9298 1.2717 6.4949 7.6556 22.8127 15.4604 5.6353 9.5338 52.6268 14.6434 11.1252 0.2039 18.8999 10.5120 16.5830 7.8518 12.5140 7.5871 13.0867 42.8641 1.4897 21.5828 22.3532 41.1406 8.9118 25.3104 9.3828 282.1319 27.3370 1.3051 28.2633 28.2783 1.5892 3.6546 10.0183 51.8711 5.8332 0.3576 5.5089 19.7240 12.1972 9.3847 45.2821
temp: 298.150 k
press: 1.00000 atm
elementType: 9 8 8 6 6 6 6 6 6 6 6 6 6 6 6 6 6 6 6 6 6 6 1 1 1 1 1 1 1 1 1 1 1 1 1 1 1
symmnumber: 1
zpe: 749757.9 jmol-1
zpe.correction: 0.285568 hartree
zpe.thermalcorrener: 0.303897 hartree
zpe.thermalcorrenthalpy: 0.304842 hartree
zpe.thermalcorrgfe: 0.238072 hartree
zpe.sumelectzpe: -981.809584 hartree
zpe.sumelectthermal: -981.791254 hartree
zpe.sumelectthermalent: -981.790310 hartree
zpe.sumelectthermalfe: -981.857080 hartree
dipole: -1.3084 -1.3116 1.0558
dipole: 2.1324
quadrupole: -107.9300 -130.4015 -121.3250
quadrupole: -5.2517 -2.4482 5.8090
quadrupole: 11.9555 -10.5160 -1.4395 -5.2517 -2.4482 5.8090
hfenergy: -982.0951515 hartree
pointgroup: C01 [X(C19H15F1O2)]
dipole: -0.535984 -0.5150106 0.3889653 debye
polarizability: 276.7501075|-46.6524481|197.4368305|-3.7169262|-5.5813729|161.4928098 unknown
InChI: InChI=1S/C19H15FO2/c1-12(15-7-4-5-9-17(15)19(21)22)18-11-14(20)10-13-6-2-3-8-16(13)18/h2-12,21H,1H3
charge 0 multiplicity 1
37 atoms
F  1.062703 3.568342 -1.241453
O  -2.154838 -1.871209 -2.583068
O  -0.614423 -2.290699 -0.916832
C  -0.5443 -0.401519 1.265939
C  0.566618 0.323059 0.47936
C  -1.941797 -0.090205 0.710222
C  1.896025 -0.247118 0.374357
C  -0.382597 -0.085271 2.778793
C  2.946877 0.514732 -0.28074
C  0.32201 1.588741 -0.067574
C  -2.420785 -0.652033 -0.522533
C  -2.799404 0.809464 1.390782
C  2.230479 -1.544348 0.890004
C  2.660619 1.808653 -0.827121
C  1.370803 2.296193 -0.708706
C  4.266835 -0.039464 -0.376601
C  -3.702603 -0.293124 -1.023388
C  -4.074873 1.155132 0.893007
C  3.524258 -2.058679 0.783929
C  4.555375 -1.299304 0.14855
C  -4.530571 0.605449 -0.324875
C  -1.628733 -1.652422 -1.294989
H  -0.39107 -1.48514 1.13279
H  -1.16049 -0.592909 3.378061
H  -0.427643 0.999294 2.984517
H  0.603916 -0.438567 3.126183
H  -0.668151 2.050749 -0.014204
H  -2.465725 1.251949 2.333303
H  1.455341 -2.155735 1.36018
H  3.438773 2.394392 -1.32569
H  5.048198 0.547662 -0.873461
H  -4.034834 -0.73555 -1.965718
H  -4.705376 1.854455 1.453483
H  3.750451 -3.054523 1.180189
H  5.567038 -1.71227 0.070264
H  -5.515812 0.869606 -0.722711
H  -1.589896 -2.554986 -3.033754
