program: Gaussian 09
title: 000252713
version: EM64L-G09RevD.01
frameworkgroup: C1[X(C19H14O2)]
method: RPBEPBE
basis: SDD
operation: Freq
keyword: #pfreq=noraman
keyword: PBEPBE/SDD
title: #p freq=noraman PBEPBE/SDD
converged: YES YES NO NO
title: Mulliken charges:
elementType: O O C C C C C C C C C C C C C C C C C C C H H H H H H H H H H H H H H
charge: -0.240047 -0.207741 -0.033205 0.350657 0.566086 -0.741447 0.062131 -0.652445 0.097054 -0.385942 -0.407531 0.387139 0.379268 -0.366575 -0.437727 -0.209495 -0.221737 -0.431120 -0.406445 -0.244291 -0.240531 0.212094 0.252562 0.251939 0.251307 0.242767 0.251584 0.270290 0.238662 0.233838 0.237075 0.240136 0.241754 0.229926 0.230009
chargesum: 0.00000
title: Mulliken charges with hydrogens summed into heavy atoms:
elementType: O O C C C C C C C C C C C C C C C C C C C
charge: -0.240047 -0.207741 -0.033205 0.350657 0.566086 -0.024852 0.062131 -0.401137 0.097054 -0.143175 -0.155947 0.387139 0.379268 -0.096285 -0.199064 0.024344 0.015338 -0.190983 -0.164690 -0.014364 -0.010523
polarizability: 3.09419032e+02 1.23119351e+01 1.58745481e+02 2.36301895e+01 8.19910737e+00 1.72722763e+02
1716.lowfreq: -4.0363 -0.0004 0.0002 0.0008 4.5460 5.7371 18.1031 45.7226 50.9661
frequency: 17.4874 45.6917 50.9494 110.9388 133.8912 167.4787 180.1911 187.6095 227.9665 257.0327 268.4754 296.9463 312.0779 319.0773 393.0761 395.8898 416.3773 471.8903 480.6613 498.3100 512.9269 526.9950 547.3699 566.9186 582.4587 604.5548 631.0753 663.9727 674.5344 695.8967 736.5719 757.6300 763.0764 772.3097 785.3510 791.4537 809.1652 827.3759 835.8162 875.9773 886.3233 892.0246 921.5322 943.3269 961.1910 963.4688 967.8106 978.3136 993.6277 1001.9706 1014.9513 1023.5359 1048.1704 1075.3510 1092.5137 1115.2486 1130.3565 1168.4302 1172.3013 1173.4995 1193.2442 1208.4397 1238.6524 1247.7445 1269.9571 1277.0476 1279.9019 1352.5739 1388.9056 1401.6669 1412.1595 1425.2081 1435.1090 1449.4682 1457.2795 1467.3016 1470.7454 1473.0362 1512.8559 1584.5029 1604.7339 1606.6956 1617.0033 1642.4691 1694.2790 2998.6649 3097.2410 3110.5917 3120.0708 3125.3880 3127.7083 3133.3001 3140.1788 3143.5753 3145.2858 3156.4870 3156.8012 3163.1463 3170.8899
redmass: 4.7564 5.0614 5.9731 4.7768 5.0678 4.7777 3.7632 3.8840 7.1827 2.7151 1.3601 3.6816 3.5929 4.7461 3.4779 3.6453 3.3159 4.1109 2.5720 4.8169 6.8033 5.7325 6.6252 4.4429 5.9605 4.5351 6.5870 4.8201 2.8761 5.4881 4.7201 1.4280 4.8497 2.5007 1.7581 2.6234 3.7418 2.5429 2.0352 1.6278 2.9333 1.4019 1.6820 4.0168 1.4369 3.7264 1.4197 1.4152 1.3495 1.3353 2.2261 2.2881 4.0852 2.0875 2.0802 1.8479 1.6751 1.2265 1.1042 1.0940 2.5362 1.8902 2.4385 3.0180 2.1689 1.5141 1.7789 1.7787 1.2224 7.9138 4.8699 2.9509 3.9889 2.4452 2.2322 1.8628 1.3246 1.0855 3.5760 7.2206 7.5644 5.6144 7.2580 6.7543 12.9384 1.0357 1.0992 1.1013 1.0862 1.0891 1.0878 1.0863 1.0906 1.0946 1.0901 1.0961 1.0954 1.1003 1.1003
irintensity: 0.2326 1.4980 0.4962 1.3224 1.2269 0.2277 1.3369 0.4510 3.5503 1.1877 0.2126 1.7570 1.2560 1.4105 0.7099 3.1590 0.8742 2.0376 20.9827 0.2635 0.0906 3.9472 0.9488 21.1401 5.4140 2.1320 0.9815 23.8345 1.7602 7.9813 8.6664 39.6767 0.4637 25.9412 37.2712 0.8929 10.0382 94.0605 45.5758 20.1875 5.0277 0.5202 16.1007 18.1156 5.2127 159.5761 5.0500 6.9069 0.0850 0.0395 4.6114 3.6861 15.3855 36.9670 18.1389 3.0303 17.2882 1.7956 9.1491 0.2075 32.7789 27.5255 5.8256 65.4747 14.1375 6.5801 11.7217 4.7807 19.3518 5.3516 1.6820 1.3793 0.5791 18.9735 3.8672 3.2900 6.1609 10.5053 14.0610 0.0504 5.4658 7.3336 18.5824 1.3398 431.0094 10.7366 17.0210 22.9510 4.0498 0.5598 6.7975 0.9742 4.4011 34.0950 7.5432 8.3181 17.5376 35.5214 21.7986
temp: 298.150 k
press: 1.00000 atm
elementType: 8 8 6 6 6 6 6 6 6 6 6 6 6 6 6 6 6 6 6 6 6 1 1 1 1 1 1 1 1 1 1 1 1 1 1
symmnumber: 1
zpe: 713080.2 jmol-1
zpe.correction: 0.271598 hartree
zpe.thermalcorrener: 0.287829 hartree
zpe.thermalcorrenthalpy: 0.288773 hartree
zpe.thermalcorrgfe: 0.227055 hartree
zpe.sumelectzpe: -881.469122 hartree
zpe.sumelectthermal: -881.452892 hartree
zpe.sumelectthermalent: -881.451948 hartree
zpe.sumelectthermalfe: -881.513665 hartree
dipole: 1.8652 5.4582 1.2724
dipole: 5.9067
quadrupole: -111.7805 -132.1048 -109.7923
quadrupole: -15.1591 -0.6347 -1.4622
quadrupole: 6.1120 -14.2122 8.1002 -15.1591 -0.6347 -1.4622
hfenergy: -881.7407204 hartree
pointgroup: C01 [X(C19H14O2)]
dipole: -0.7244553 2.1981886 0.208821 debye
polarizability: 308.5737651|-19.9506185|165.4497691|20.5746301|-11.1852551|166.8637421 unknown
InChI: InChI=1S/C19H14O2/c1-19(17-9-5-4-8-16(17)18(20)21-19)15-11-10-13-6-2-3-7-14(13)12-15/h2-12H,1H3
charge 0 multiplicity 1
35 atoms
O  1.620563 -1.646999 -1.006719
O  3.509829 -2.672531 -0.080709
C  1.036764 -0.241574 -1.091858
C  2.014226 0.57768 -0.242792
C  -0.370593 -0.288038 -0.486463
C  1.098584 0.157193 -2.57659
C  3.057504 -0.25093 0.217337
C  -1.490808 0.21119 -1.155576
C  2.834089 -1.643251 -0.25508
C  -0.531887 -0.843046 0.830353
C  1.99071 1.945623 0.083315
C  -2.793373 0.183462 -0.554524
C  -2.946737 -0.376448 0.771495
C  4.113924 0.248526 1.005669
C  -1.783153 -0.887848 1.43767
C  3.046018 2.459971 0.875702
C  4.09915 1.622694 1.332022
C  -3.950847 0.693301 -1.230127
C  -4.248009 -0.405221 1.371205
C  -5.208234 0.653258 -0.622033
C  -5.358381 0.099972 0.689687
H  0.754072 1.196259 -2.722953
H  2.138905 0.087034 -2.934509
H  0.47513 -0.520599 -3.182764
H  -1.398767 0.632599 -2.1625
H  0.341822 -1.249326 1.350451
H  1.176471 2.596842 -0.25213
H  4.910935 -0.419563 1.34776
H  -1.893633 -1.321048 2.438779
H  3.049635 3.521867 1.145733
H  4.901317 2.049318 1.943498
H  -3.836823 1.115184 -2.236128
H  -4.360022 -0.832049 2.375044
H  -6.086596 1.044193 -1.147009
H  -6.349783 0.073602 1.155042
