program: Gaussian 09
title: 000252710
version: EM64L-G09RevD.01
frameworkgroup: C1[X(C18H13FO2)]
method: RPBEPBE
basis: SDD
operation: Freq
keyword: #p
keyword: freq=noraman
keyword: PBEPBE/SDD
title: #p freq=noraman PBEPBE/SDD
converged: YES YES NO NO
title: Mulliken charges:
elementType: F O O C C C C C C C C C C C C C C C C C C H H H H H H H H H H H H H
charge: -0.205607 -0.444410 -0.257235 -0.647430 0.483076 0.327550 0.150738 -0.579677 0.439372 -0.372727 -0.434880 0.066695 -0.357726 0.176616 -0.441227 -0.312226 -0.401680 -0.204687 -0.239038 -0.236566 0.103054 0.254481 0.251215 0.272427 0.245458 0.240247 0.259231 0.241860 0.281766 0.255672 0.232452 0.233613 0.236045 0.383548
chargesum: 0.00000
title: Mulliken charges with hydrogens summed into heavy atoms:
elementType: F O O C C C C C C C C C C C C C C C C C C
charge: -0.205607 -0.060862 -0.257235 -0.141734 0.483076 0.327550 0.150738 -0.307251 0.439372 -0.127269 -0.194633 0.066695 -0.098495 0.176616 -0.199367 -0.030460 -0.146008 0.027765 -0.005425 -0.000521 0.103054
polarizability: 3.13137014e+02 -1.02800365e+01 1.69000261e+02 1.09569772e+01 4.38433088e+00 1.41621392e+02
1716.lowfreq: -6.0764 -3.2693 -0.0002 0.0003 0.0005 7.4477 14.5284 22.1408 43.0759
frequency: 13.6527 21.7344 43.0703 50.1656 113.1609 125.4616 148.1162 168.3089 190.3124 222.7712 226.8822 277.7813 312.3351 322.0084 378.0395 415.6711 417.7522 441.8994 466.1969 482.5971 494.8303 507.0852 521.2911 551.9541 564.4428 585.3710 588.1626 608.3865 660.4109 685.8288 702.1621 721.7337 728.7590 750.9131 753.0864 795.0313 799.8651 806.5792 846.0306 851.9113 877.4783 893.1285 904.5297 917.2753 947.9695 966.7304 981.5450 982.3952 994.8095 1005.5879 1020.9444 1049.3213 1063.5372 1099.7695 1156.4363 1160.1105 1168.7206 1179.3934 1182.9234 1191.3489 1199.8226 1231.7327 1243.0901 1268.3279 1269.4231 1306.1627 1321.8050 1350.1419 1381.2897 1406.8214 1419.9686 1423.4957 1437.8720 1442.3732 1464.5686 1478.3778 1511.7208 1574.3974 1579.2008 1608.1117 1610.1572 1632.4348 1647.4887 2994.0198 3042.9304 3121.0517 3132.5069 3133.5445 3144.2136 3149.6780 3150.6654 3157.0641 3163.3163 3179.2768 3183.4348 3529.4614
redmass: 5.4062 6.4621 6.7204 8.0890 4.5768 5.1031 8.1561 4.6259 5.6367 3.1430 4.8727 6.1677 5.1964 3.2216 7.3526 3.1919 3.0995 5.4947 3.7228 4.3740 3.9384 6.7444 7.1342 6.4926 3.4999 4.2861 1.2357 5.3260 4.3499 3.9855 6.3130 4.3756 2.2295 1.8607 2.4138 2.0206 2.9302 2.9758 1.9209 2.7241 1.7251 1.4699 2.3640 1.5699 2.1919 1.3277 1.4033 1.3922 5.3854 1.3449 3.1492 2.4078 2.0870 2.2319 1.5552 1.5954 1.1330 1.0870 2.1047 1.1526 2.0387 1.6464 2.5333 1.6665 1.7851 1.9144 1.8986 2.1005 6.8789 3.7314 1.8622 2.6603 2.6729 1.6458 3.5744 2.4459 3.8813 6.5033 7.6459 6.1182 6.2389 7.8535 7.3804 1.0636 1.0956 1.0867 1.0862 1.0875 1.0965 1.0928 1.0911 1.0939 1.0967 1.0971 1.0965 1.0641
irintensity: 0.3273 0.0911 0.6968 0.8142 0.4914 0.5555 0.8627 1.2726 1.5404 6.3319 0.1216 1.6449 1.0355 0.0974 5.4625 4.9987 10.2045 13.7118 2.8698 0.4114 3.8973 2.9695 0.2820 0.6068 6.3491 21.5186 109.3900 33.7351 6.9244 30.9853 16.5328 1.6774 52.5514 40.7478 5.7668 17.7712 4.0686 16.6191 49.8358 24.5455 0.5509 3.5647 7.2637 10.5925 7.7710 1.0726 2.3898 5.0853 333.2648 0.2469 20.7109 16.5876 15.0150 80.9850 40.8508 39.5837 0.1216 1.2154 7.2808 1.3869 19.0608 3.6381 12.7575 4.3031 3.0253 52.3479 45.0459 33.1241 6.3628 3.9937 4.1578 4.1250 15.0666 6.3907 26.0804 64.9415 14.3864 35.7674 10.1330 2.6241 31.3935 283.1159 0.1914 4.7918 4.9284 5.8173 1.9889 1.8409 17.6121 11.0280 9.7315 23.1688 14.9109 7.5201 8.3786 52.9112
temp: 298.150 k
press: 1.00000 atm
elementType: 9 8 8 6 6 6 6 6 6 6 6 6 6 6 6 6 6 6 6 6 6 1 1 1 1 1 1 1 1 1 1 1 1 1
symmnumber: 1
zpe: 675864.1 jmol-1
zpe.correction: 0.257423 hartree
zpe.thermalcorrener: 0.274447 hartree
zpe.thermalcorrenthalpy: 0.275392 hartree
zpe.thermalcorrgfe: 0.210116 hartree
zpe.sumelectzpe: -942.591295 hartree
zpe.sumelectthermal: -942.574271 hartree
zpe.sumelectthermalent: -942.573327 hartree
zpe.sumelectthermalfe: -942.638603 hartree
dipole: 0.4422 2.7130 1.1336
dipole: 2.9734
quadrupole: -99.4611 -119.5139 -120.0540
quadrupole: -4.6274 -4.6490 -0.0664
quadrupole: 13.5486 -6.5042 -7.0443 -4.6274 -4.6490 -0.0664
hfenergy: -942.8487184 hartree
pointgroup: C01 [X(C18H13F1O2)]
dipole: 0.286243 -1.1313996 0.0804216 debye
polarizability: 304.7978672|14.8750781|168.1916069|-35.28394|-12.4188459|150.7691932 unknown
InChI: InChI=1S/C18H13FO2/c19-17-7-3-5-13-9-8-12(11-16(13)17)10-14-4-1-2-6-15(14)18(20)21/h1-9,11,20H,10H2
charge 0 multiplicity 1
34 atoms
F  -3.561896 1.968182 1.71386
O  5.181647 1.343879 -1.679635
O  3.025034 2.066399 -2.087341
C  0.882493 0.756039 -0.765025
C  -0.476942 0.106725 -0.561243
C  2.051175 0.071345 -0.045057
C  -2.768615 0.125092 0.345893
C  -1.479765 0.729913 0.188916
C  -3.052039 -1.151808 -0.277036
C  -0.761126 -1.162331 -1.176428
C  -2.007189 -1.77168 -1.04033
C  3.423496 0.340995 -0.371076
C  1.795119 -0.847224 1.004534
C  -3.824414 0.723047 1.098796
C  -4.347728 -1.745889 -0.118425
C  4.46996 -0.314559 0.337729
C  -5.080326 0.153039 1.257269
C  -5.338832 -1.107486 0.631754
C  2.838223 -1.484332 1.709568
C  4.185788 -1.222072 1.373534
C  3.793476 1.313512 -1.434412
H  1.111638 0.81218 -1.844539
H  0.846956 1.814149 -0.441193
H  -1.292226 1.69774 0.665704
H  0.024926 -1.64962 -1.765475
H  -2.207169 -2.735852 -1.522365
H  0.756369 -1.0637 1.272107
H  -4.551243 -2.710963 -0.595833
H  5.50347 -0.092281 0.060918
H  -5.845191 0.665036 1.847684
H  -6.3261 -1.565705 0.749077
H  2.597614 -2.183238 2.518576
H  5.001067 -1.715009 1.913137
H  5.352952 2.022377 -2.386548
