program: Gaussian 09
title: 000252703
version: EM64L-G09RevD.01
frameworkgroup: C1[X(C17H11FO)]
method: RPBEPBE
basis: SDD
operation: Freq
keyword: #p
keyword: freq=noraman
keyword: PBEPBE/SDD
title: #p freq=noraman PBEPBE/SDD
converged: YES YES NO NO
title: Mulliken charges:
elementType: F O C C C C C C C C C C C C C C C C C H H H H H H H H H H H
charge: -0.202516 -0.222548 0.381195 0.397579 0.312231 -0.549386 -0.431511 -0.382380 0.003674 -0.560677 -0.377504 0.294699 0.331623 -0.382278 -0.370113 -0.360605 -0.236599 -0.232292 -0.229279 0.282023 0.243813 0.270711 0.273885 0.246645 0.259632 0.266822 0.272619 0.232499 0.233973 0.234066
chargesum: 0.00000
title: Mulliken charges with hydrogens summed into heavy atoms:
elementType: F O C C C C C C C C C C C C C C C C C
charge: -0.202516 -0.222548 0.381195 0.397579 0.312231 -0.267363 -0.187698 -0.111668 0.003674 -0.286793 -0.130859 0.294699 0.331623 -0.122646 -0.103292 -0.087986 -0.004100 0.001680 0.004787
polarizability: 3.32689981e+02 -3.45811915e-02 1.72724672e+02 -1.01031568e+01 -3.15830841e+00 9.26544870e+01
1716.lowfreq: -4.4789 -0.0012 -0.0009 -0.0005 2.0842 6.9029 28.5537 52.0550 69.3767
frequency: 28.5342 52.0434 69.3712 101.1509 130.7510 156.6808 177.6612 243.4659 255.6208 293.5671 304.4277 366.4139 402.2857 409.0673 412.9354 441.4298 454.0160 475.3904 523.0842 568.5673 594.0316 613.7372 626.7554 640.7150 672.9195 700.5312 712.2131 724.2273 760.3808 772.4854 795.0981 813.9067 855.9142 865.3985 868.1270 878.1132 941.7710 947.8747 950.9050 958.5390 982.3842 984.0715 989.8068 992.4698 1005.8948 1028.0326 1084.3166 1117.5957 1137.1459 1151.8355 1163.2367 1174.7621 1189.3708 1232.2692 1239.2850 1270.9818 1279.7143 1318.2003 1325.7999 1383.6848 1412.7076 1421.7375 1429.2142 1434.0074 1453.9864 1477.5513 1513.0347 1536.3100 1580.6391 1587.2385 1604.8533 1609.0991 1639.7985 3128.6757 3129.5181 3138.4733 3140.0846 3144.5443 3149.4768 3158.3893 3161.3197 3165.9744 3169.7103 3177.1839
redmass: 7.1831 4.6323 4.5676 7.0480 6.0502 7.5751 5.1297 5.7005 5.3729 7.9772 5.2321 7.0524 3.5297 4.0835 3.4932 6.0224 4.4176 2.5703 5.6032 6.0679 5.6540 6.4594 5.8000 3.6894 6.3264 2.4849 2.6635 3.0795 4.8084 2.4287 1.6797 1.9470 1.5725 1.5098 1.4202 4.0001 1.5620 1.5778 4.1108 1.3361 1.3839 3.4724 4.9953 1.4114 1.3369 2.0973 1.5868 1.6725 1.8860 1.8704 1.2918 1.0570 1.1222 3.0272 1.6406 1.8173 3.3052 1.4137 1.6740 8.6596 6.0809 4.2206 4.9531 2.4311 2.6230 2.2628 3.9102 9.8344 7.4924 6.4755 6.1496 6.2110 7.1543 1.0858 1.0878 1.0882 1.0896 1.0917 1.0926 1.0963 1.0957 1.0930 1.1013 1.0963
irintensity: 0.3670 0.3736 0.2783 2.0452 0.2611 1.0969 1.2159 1.0746 4.0126 2.3050 1.2344 2.3226 0.2748 2.1746 0.1105 1.3012 8.7409 23.0079 2.6646 13.4610 10.1220 1.0048 3.5114 2.1673 32.6860 19.2159 59.3209 45.5998 0.7131 1.8077 18.6092 8.0319 47.3827 2.6580 38.3802 15.5048 15.2724 13.1965 24.2115 1.4410 3.8502 33.7781 12.6351 1.5116 1.3892 2.8419 11.2045 45.7228 4.5198 28.2207 4.1197 0.7693 32.5687 193.9904 38.3908 18.3457 241.0718 9.1046 5.3646 2.4025 7.8697 7.4723 0.8085 15.6832 54.5560 3.7998 37.6020 134.9606 4.1299 6.2939 111.9378 3.3374 7.2050 2.0869 3.8868 5.8663 9.2856 1.1315 21.9828 14.7943 10.6086 2.3972 25.6813 5.2564
temp: 298.150 k
press: 1.00000 atm
elementType: 9 8 6 6 6 6 6 6 6 6 6 6 6 6 6 6 6 6 6 1 1 1 1 1 1 1 1 1 1 1
symmnumber: 1
zpe: 591998.9 jmol-1
zpe.correction: 0.225480 hartree
zpe.thermalcorrener: 0.240003 hartree
zpe.thermalcorrenthalpy: 0.240947 hartree
zpe.thermalcorrgfe: 0.182919 hartree
zpe.sumelectzpe: -828.207140 hartree
zpe.sumelectthermal: -828.192618 hartree
zpe.sumelectthermalent: -828.191673 hartree
zpe.sumelectthermalfe: -828.249702 hartree
dipole: 1.7093 -4.3524 0.0572
dipole: 4.6764
quadrupole: -100.0315 -106.0284 -110.9655
quadrupole: 1.3477 2.7143 0.9502
quadrupole: 5.6436 -0.3533 -5.2904 1.3477 2.7143 0.9502
hfenergy: -828.4326204 hartree
pointgroup: C01 [X(C17H11F1O1)]
dipole: 0.5723662 -0.07921 1.7467364 debye
polarizability: 332.5902033|-2.3623333|92.2185196|8.9225586|-2.7688638|173.2604171 unknown
InChI: InChI=1S/C17H11FO/c18-16-9-8-12-6-7-14(10-15(12)11-16)17(19)13-4-2-1-3-5-13/h1-11H
charge 0 multiplicity 1
30 atoms
F  -5.792723 0.63181 -1.387972
O  1.644352 -0.168322 -2.335576
C  -2.215664 0.04918 -0.55175
C  -2.353311 -0.467351 0.798225
C  0.236315 -0.179099 -0.386152
C  -0.909524 0.170571 -1.116934
C  -1.171482 -0.843821 1.516789
C  0.092834 -0.699098 0.947404
C  1.573247 -0.064341 -1.069873
C  -3.392451 0.419767 -1.285469
C  -3.66358 -0.595673 1.367216
C  2.822337 0.17404 -0.268021
C  -4.63029 0.271156 -0.677317
C  -4.800191 -0.231538 0.643883
C  2.820588 0.88834 0.961097
C  4.059487 -0.268095 -0.810857
C  4.033588 1.143001 1.637626
C  5.266785 -0.028576 -0.126041
C  5.256783 0.677019 1.102235
H  -0.785203 0.535515 -2.142711
H  -1.275436 -1.257814 2.526529
H  0.982015 -1.015293 1.501228
H  -3.31735 0.810193 -2.30492
H  -3.766471 -0.987111 2.385311
H  -5.808076 -0.321436 1.059006
H  1.880289 1.273903 1.369039
H  4.046823 -0.790462 -1.773201
H  4.025869 1.707828 2.576256
H  6.214082 -0.383717 -0.54603
H  6.19616 0.869022 1.632783
