program: Gaussian 09
title: 000260876
version: EM64L-G09RevD.01
frameworkgroup: C1[X(C19H16N4O2S)]
method: RPBEPBE
basis: SDD
operation: Freq
keyword: #p
keyword: freq=noraman
keyword: PBEPBE/SDD
title: #p freq=noraman PBEPBE/SDD
converged: YES YES NO NO
title: Mulliken charges:
elementType: S O O N N N N C C C C C C C C C C C C C C C C C C C H H H H H H H H H H H H H H H H
charge: 0.226696 -0.313242 -0.253501 -0.129627 0.005614 -0.325785 -0.339467 0.160494 -0.625837 -0.192911 -0.049970 0.493991 0.183367 0.162443 -0.775376 -0.377895 -0.390055 0.469008 -0.232753 -0.229472 -0.232546 -0.377932 -0.373740 -0.220329 -0.221061 -0.233117 0.277343 0.244989 0.338196 0.298281 0.308979 0.337736 0.240046 0.289548 0.227472 0.227771 0.229738 0.241297 0.239402 0.230193 0.229965 0.232048
chargesum: 0.00000
title: Mulliken charges with hydrogens summed into heavy atoms:
elementType: S O O N N N N C C C C C C C C C C C C C C C C C C C
charge: 0.226696 -0.313242 -0.253501 -0.129627 0.005614 0.012411 -0.001731 0.160494 -0.103505 -0.192911 -0.049970 0.493991 0.183367 0.162443 -0.168116 -0.137849 -0.100507 0.469008 -0.005280 -0.001701 -0.002808 -0.136635 -0.134338 0.009864 0.008904 -0.001069
polarizability: 3.67536018e+02 2.06235162e+01 2.52413958e+02 3.38826403e-01 4.99314536e+00 1.73874611e+02
1716.lowfreq: -3.1005 -0.0014 -0.0012 -0.0011 1.9187 4.0218 11.6817 20.2237 21.5604
frequency: 11.5348 20.0847 21.5203 34.7844 36.8366 45.8047 69.0823 85.3709 102.6283 112.5967 125.3548 159.5685 173.9508 181.4871 207.7139 244.6083 256.0389 306.7236 319.9371 323.0947 350.0651 358.3110 402.0165 404.8194 408.7572 419.0485 457.3073 477.5767 485.2666 517.8674 537.7469 552.6051 568.1774 598.3490 616.4581 617.3352 625.2084 644.2999 653.2730 670.5082 698.0062 702.3135 706.1608 722.4922 751.5443 774.8678 778.1698 797.2247 811.5095 819.8812 853.5212 862.3378 885.6213 929.8818 941.3831 955.3139 979.2726 988.5890 990.0632 990.1366 998.9114 1002.0831 1007.4923 1026.4268 1029.0020 1052.8078 1074.8224 1090.1794 1112.1430 1124.7757 1174.0779 1174.3622 1185.0221 1188.4702 1194.3907 1209.9780 1220.6743 1230.0447 1248.9678 1287.9542 1311.2067 1325.8001 1334.7126 1342.0680 1359.4189 1364.1764 1378.4970 1385.0880 1388.7389 1429.3549 1440.8122 1445.6476 1447.3081 1464.0776 1470.1192 1480.3156 1484.1570 1488.5386 1593.5414 1594.6823 1613.0207 1613.6626 1615.7383 1660.8754 3021.2335 3060.5169 3094.4126 3123.1253 3124.0510 3125.9396 3128.4586 3138.4205 3138.4951 3139.7595 3148.9073 3150.4934 3164.0825 3166.6640 3545.1809 3555.1392
redmass: 5.0819 4.2655 4.5357 6.4829 5.9286 4.6582 5.5883 7.0627 6.2594 7.9756 10.8675 5.3625 4.5044 6.7583 7.8823 5.8836 6.4419 4.0278 8.6601 2.2766 2.0382 1.9849 2.8024 3.1114 3.7881 10.6668 4.3563 4.1194 10.7482 6.2749 1.2029 6.0490 6.0311 7.4095 6.3331 6.2909 4.8359 6.1554 6.1634 7.7160 10.3692 1.7342 2.3972 2.2007 10.6382 2.7003 2.8402 5.5011 3.9258 3.3096 1.2500 1.2502 1.5216 1.4477 1.4577 2.0505 1.3910 1.3909 5.8362 6.1526 1.3206 4.6464 1.4083 2.1968 2.2786 3.8541 1.4912 1.6334 5.3206 1.0810 1.0527 1.0632 1.8098 1.1438 1.1871 2.5986 2.1099 5.5380 1.4614 6.4350 2.9045 1.2789 2.0304 1.7716 1.7826 2.9495 2.6621 8.8446 3.1673 2.6876 2.1991 2.0970 1.1288 1.4271 5.8005 2.4862 2.3553 2.0853 6.1009 6.0435 5.8247 6.1091 5.5627 7.5082 1.0621 1.0583 1.1025 1.0850 1.0853 1.0886 1.0883 1.0921 1.0927 1.1089 1.0965 1.0964 1.1016 1.1017 1.0797 1.0796
irintensity: 0.1146 0.0357 0.4116 0.2883 0.2178 1.8988 0.7067 0.3193 1.3576 11.5994 0.0913 0.6967 0.8922 4.1180 0.9959 0.8945 2.1838 1.2767 4.5901 0.6794 1.2211 4.8109 0.0026 0.7832 2.6410 22.0717 2.1764 1.9114 4.2259 14.3310 224.8071 38.3963 13.6353 3.4602 0.1348 0.7096 27.1135 27.7652 7.6499 28.3513 14.2057 54.1700 43.1579 79.1915 1.8316 25.4643 10.0686 3.3905 16.7699 4.0919 0.0107 0.5735 0.3507 3.1302 7.1318 13.2625 0.0067 0.4064 0.8298 0.4574 0.0592 0.5069 2.7880 6.9319 8.8531 159.8180 8.6180 13.6428 19.3310 1.8260 0.0148 0.3015 22.7597 3.0895 5.6645 11.2682 1.2634 61.4982 67.4415 80.0111 32.2084 0.2856 161.6388 89.8261 13.5888 38.1992 26.5382 0.3291 30.0481 10.0769 8.9854 2.8810 13.8481 22.7462 88.0360 12.2362 9.9733 33.3123 0.9983 14.7330 306.2041 6.0057 352.2240 134.7043 16.1645 3.1549 0.6394 1.6362 5.7055 0.7814 6.8984 15.7609 7.3437 1.0091 25.6145 35.5711 31.8056 25.3508 13.2987 173.4684
temp: 298.150 k
press: 1.00000 atm
elementType: 16 8 8 7 7 7 7 6 6 6 6 6 6 6 6 6 6 6 6 6 6 6 6 6 6 6 1 1 1 1 1 1 1 1 1 1 1 1 1 1 1 1
symmnumber: 1
zpe: 829197.7 jmol-1
zpe.correction: 0.315825 hartree
zpe.thermalcorrener: 0.338628 hartree
zpe.thermalcorrenthalpy: 0.339573 hartree
zpe.thermalcorrgfe: 0.259091 hartree
zpe.sumelectzpe: -1499.315357 hartree
zpe.sumelectthermal: -1499.292553 hartree
zpe.sumelectthermalent: -1499.291609 hartree
zpe.sumelectthermalfe: -1499.372090 hartree
dipole: -0.2997 1.7560 -0.9172
dipole: 2.0036
quadrupole: -120.9772 -163.5960 -158.0759
quadrupole: 17.3421 -7.1213 14.7861
quadrupole: 26.5725 -16.0463 -10.5262 17.3421 -7.1213 14.7861
hfenergy: -1499.6311818 hartree
pointgroup: C01 [X(C19H16N4O2S1)]
dipole: -0.1115942 -0.6857314 0.3724614 debye
polarizability: 367.9647148|-19.395887|252.1332894|0.5339551|3.5734378|173.7265823 unknown
InChI: InChI=1S/C19H16N4O2S/c24-17-15-16(18(25)22-21-17)23(11-13-7-3-1-4-8-13)19(20-15)26-12-14-9-5-2-6-10-14/h1-10,21-22H,11-12H2
charge 0 multiplicity 1
42 atoms
S  1.587024 -0.234999 0.498326
O  -4.2640 0.172655 1.305118
O  -1.702436 4.21111 -1.538478
N  -1.19445 0.113645 0.728016
N  -0.12274 1.789663 -0.411252
N  -4.225414 2.169646 0.112542
N  -3.564264 3.198171 -0.598567
C  -2.168704 1.044538 0.354398
C  -1.408667 -1.165875 1.466832
C  0.019638 0.609944 0.238613
C  -1.485009 2.066107 -0.34017
C  -1.672254 -2.361297 0.554731
C  -3.59583 1.041038 0.648073
C  -2.179802 3.240292 -0.885799
C  2.747302 1.148248 -0.196333
C  -0.606634 -3.185221 0.112477
C  -2.998721 -2.665113 0.153316
C  4.174992 0.679114 -0.095635
C  -0.860171 -4.291054 -0.729821
C  -3.250492 -3.771334 -0.688266
C  -2.182921 -4.585678 -1.133419
C  4.780218 -0.023468 -1.170205
C  4.938978 0.937864 1.072286
C  6.122136 -0.4547 -1.081365
C  6.280853 0.507498 1.163141
C  6.875841 -0.190532 0.086145
H  -2.269257 -0.996116 2.133548
H  -0.50347 -1.327768 2.079805
H  -5.225934 2.290285 0.285895
H  2.531779 2.042613 0.406454
H  2.408031 1.320425 -1.227835
H  -4.147792 3.95759 -0.956907
H  0.420784 -2.962825 0.4243
H  -3.821272 -2.032743 0.507553
H  -0.030116 -4.922056 -1.066523
H  -4.278048 -4.001198 -0.991667
H  -2.380102 -5.444986 -1.784347
H  4.197454 -0.227435 -2.07646
H  4.479944 1.480439 1.907457
H  6.579636 -0.991306 -1.919817
H  6.861739 0.717887 2.067905
H  7.917751 -0.52257 0.154834
