program: Gaussian 09
title: 000252690
version: EM64L-G09RevD.01
frameworkgroup: C1[X(C10H8O2)]
method: RPBEPBE
basis: SDD
operation: Freq
keyword: #pfreq=noraman
keyword: PBEPBE/SDD
title: #p freq=noraman PBEPBE/SDD
converged: NO YES NO NO
title: Mulliken charges:
elementType: O O C C C C C C C C C C H H H H H H H H
charge: -0.262798 -0.251140 0.185146 0.177716 0.358730 0.153333 -0.448358 -0.353090 -0.353090 -0.245273 -0.203659 -0.772327 0.258943 0.280652 0.260646 0.236603 0.236687 0.249742 0.249747 0.241788
chargesum: 0.00000
title: Mulliken charges with hydrogens summed into heavy atoms:
elementType: O O C C C C C C C C C C
charge: -0.262798 -0.251140 0.185146 0.177716 0.358730 0.153333 -0.189414 -0.072438 -0.092444 -0.008670 0.033028 -0.031049
polarizability: 1.53569334e+02 9.51165717e-01 1.32715015e+02 3.76191781e-03 -1.46407598e-02 4.93998680e+01
1716.lowfreq: -10.4395 -3.4219 -0.0008 0.0000 0.0004 8.5692 99.4126 124.4822 150.4438
frequency: 99.4122 124.4813 150.4436 181.0029 246.5776 274.2314 301.0341 426.2170 427.8297 469.6623 517.4985 524.9117 554.9523 559.2504 645.3113 670.3546 735.0100 761.0979 784.6227 814.5297 870.6154 885.3298 918.8612 972.8877 1001.8746 1007.8839 1021.7396 1051.6128 1079.5886 1117.5630 1160.0476 1172.4582 1196.7957 1248.0043 1282.1114 1336.0465 1397.8173 1403.2268 1446.5184 1452.6601 1460.7914 1461.9298 1560.2174 1578.5070 1620.7679 1641.4008 2993.4958 3074.1321 3120.9740 3138.9209 3151.4842 3164.9392 3175.6770 3179.3219
redmass: 4.2772 1.1317 5.1224 3.1024 3.5496 5.1047 4.7939 6.2989 3.3436 6.0466 3.5332 8.5936 4.1480 5.4930 5.8889 3.3207 5.2918 2.4420 1.4983 5.0520 1.4347 1.5110 6.0728 1.3666 1.3300 1.6724 2.0853 1.5258 2.8496 2.0398 1.4551 1.9096 2.4696 1.6997 1.7054 3.5760 5.9647 1.3829 2.6530 1.0438 2.6759 1.0861 8.7503 7.4190 7.1482 7.1863 1.0376 1.0976 1.0991 1.0861 1.0901 1.0955 1.1001 1.0927
irintensity: 6.1733 0.0012 0.2416 1.6764 3.0617 0.6912 4.9034 1.0103 1.7036 1.2054 1.3962 0.5846 4.4571 9.1910 2.4120 5.1368 2.9474 31.4602 68.3040 10.4980 22.0564 2.6723 32.5444 2.8970 0.1755 8.6643 7.6376 10.3653 10.5080 15.9309 15.1675 17.0810 38.4555 3.9549 1.7902 220.5640 8.8211 50.3389 59.6076 16.9095 0.6381 12.1876 132.4443 12.3619 32.8208 229.2225 9.7240 9.4778 10.5990 3.7069 3.8363 11.1654 17.4140 2.2318
temp: 298.150 k
press: 1.00000 atm
elementType: 8 8 6 6 6 6 6 6 6 6 6 6 1 1 1 1 1 1 1 1
symmnumber: 1
zpe: 398444.0 jmol-1
zpe.correction: 0.151759 hartree
zpe.thermalcorrener: 0.161364 hartree
zpe.thermalcorrenthalpy: 0.162308 hartree
zpe.thermalcorrgfe: 0.116897 hartree
zpe.sumelectzpe: -535.474567 hartree
zpe.sumelectthermal: -535.464962 hartree
zpe.sumelectthermalent: -535.464018 hartree
zpe.sumelectthermalfe: -535.509429 hartree
dipole: 0.4263 -4.1545 0.0012
dipole: 4.1763
quadrupole: -50.9541 -77.6639 -72.0478
quadrupole: -1.5163 0.0007 0.0042
quadrupole: 15.9345 -10.7753 -5.1592 -1.5163 0.0007 0.0042
hfenergy: -535.6263262 hartree
pointgroup: C01 [X(C10H8O2)]
dipole: 0.0865799 1.6407997 -0.0004549 debye
dipolederiv: -1.4151653 0.2010598 -0.0000452 0.0176289 -0.607596 0.000072 -0.0000936 0.000229 -0.1482971 -0.5364675 -0.0563171 -0.0000186 0.0839717 -1.1640506 -0.0000989 -0.0000176 0.0005097 -0.3647985 -0.431728 0.2890114 -0.0000541 0.1481376 -0.3393065 0.0000531 0.000098 0.0000031 -0.0186704 0.9146149 0.0575354 -0.000045 0.1405068 0.1855069 0.0000562 0.0000629 -0.0001245 0.100676 1.0625126 -0.1197618 0.0001276 -0.0544182 0.9775989 -0.0000627 0.0001308 -0.0002536 0.0634514 1.0515371 0.167922 0.0000321 -0.1494942 1.3051579 -0.0000475 -0.0000584 -0.0002992 0.2038655 -0.4588131 -0.5054309 0.000089 -0.2804537 -0.6218179 0.0000376 -0.000057 -0.0000171 -0.2123516 0.0517324 -0.1276178 -0.000011 0.0913245 0.0816547 -0.0000055 -0.000012 -0.0000153 -0.1044798 -0.3241773 -0.0380385 0.0000078 0.0533498 0.0777138 -0.0000494 0.0000223 -0.0000252 -0.1697303 0.0604591 0.1629086 -0.0000686 0.1238275 -0.1819223 -0.0000173 -0.0000554 -0.0000421 -0.1676937 0.0974643 0.002507 -0.0000423 -0.0557491 0.1676488 -0.0000347 -0.0000245 -0.0000337 -0.1399214 -0.2015863 -0.086009 -0.0000144 -0.2219543 -0.0872844 0.0000126 0.0000472 -0.0000138 0.0455465 -0.0426172 0.0347222 -0.0000375 0.0681007 0.0783544 0.0000051 -0.000048 0.0000372 0.1612978 0.1159403 0.0191924 0.0000039 -0.0570709 0.0054364 0.000012 0.0000333 0.000015 0.1555482 0.0933534 -0.0495207 0.0000159 -0.0138579 -0.0395254 0.0000304 -0.0000247 0.0000161 0.1772345 -0.098904 -0.0590752 0.000036 -0.0651764 0.0645798 0.0000251 0.0000365 0.0000372 0.1653029 -0.0383335 0.1017995 0.0000081 0.1012255 0.0168839 0.0000057 0.000021 0.0000094 0.1580822 0.0654787 -0.0203659 0.0224499 -0.0311695 0.0360504 -0.0944233 -0.0233491 -0.1111531 -0.0146422 0.0654783 -0.0203904 -0.022409 -0.0311828 0.0361373 0.0943977 0.0233452 0.1111053 -0.0146742 -0.0307789 0.045869 -0.0000247 0.132454 0.00878 0.0000316 -0.0000569 0.0000156 0.124254 unknown
polarizability: 153.6122823|0.0848743|132.6720662|-0.0030323|-0.0148091|49.399868 unknown
InChI: InChI=1S/C10H8O2/c1-7-6-9(11)8-4-2-3-5-10(8)12-7/h2-6H,1H3
charge 0 multiplicity 1
20 atoms
O  0.968725 1.381074 -0.000557
O  0.573407 -2.788988 0.000651
C  -0.496846 -0.608885 -0.000252
C  -0.317822 0.798559 -0.000445
C  2.095241 0.541634 -0.000284
C  0.684323 -1.518581 -0.000467
C  1.979771 -0.827638 -0.000088
C  -1.822333 -1.11785 0.000015
C  -1.410187 1.692232 -0.00043
C  -2.923104 -0.24464 0.000042
C  -2.714052 1.162412 -0.000185
C  3.364937 1.341704 -0.00015
H  2.8842 -1.4413 0.000262
H  -1.943055 -2.206291 0.000138
H  -1.223406 2.770096 -0.000576
H  -3.942844 -0.642985 0.000223
H  -3.572184 1.843017 -0.000156
H  3.413001 1.995005 0.889907
H  3.413327 1.994818 -0.890328
H  4.240302 0.674306 0.000083
