program: Gaussian 09
title: 000252666
version: EM64L-G09RevD.01
frameworkgroup: C1[X(C16H15N3O4S2)]
method: RPBEPBE
basis: SDD
operation: Freq
keyword: #p
keyword: freq=noraman
keyword: PBEPBE/SDD
title: #p freq=noraman PBEPBE/SDD
converged: YES YES NO NO
title: Mulliken charges:
elementType: S S O O O O N N N C C C C C C C C C C C C C C C C H H H H H H H H H H H H H H H
charge: 0.950457 0.269620 -0.528165 -0.510626 -0.231474 -0.244857 -0.522626 -0.434162 -0.455497 0.399478 0.697012 -0.127137 -0.451601 -0.554856 -0.358629 -0.246066 -0.197328 -0.240294 -0.755888 0.169321 0.498551 -0.326008 -0.424431 0.232300 -0.776961 0.279932 0.232946 0.295707 0.251992 0.331025 0.282863 0.288813 0.293618 0.301232 0.321922 0.234471 0.309657 0.215770 0.264919 0.265000
chargesum: 0.00000
title: Mulliken charges with hydrogens summed into heavy atoms:
elementType: S S O O O O N N N C C C C C C C C C C C C C C C C
charge: 0.950457 0.269620 -0.528165 -0.510626 -0.231474 -0.244857 -0.242694 -0.103136 -0.145840 0.399478 0.697012 -0.127137 -0.451601 -0.321911 -0.062922 0.005925 0.085535 0.048519 -0.161038 0.169321 0.498551 -0.004086 -0.189960 0.232300 -0.031272
polarizability: 3.02452128e+02 -3.37566221e+01 3.35041233e+02 3.31047408e+01 -1.02763842e-01 2.11617195e+02
1716.lowfreq: -4.1804 -0.0001 0.0017 0.0022 3.1231 5.7712 8.6340 13.1366 29.4114
frequency: 8.3326 12.9868 29.3651 43.0321 47.6745 58.7918 75.9923 77.6762 96.7999 100.1308 116.1278 139.2745 156.4004 173.2791 182.9191 188.6302 209.1643 262.5334 286.0839 301.5912 314.5089 328.0021 346.3231 370.4893 373.3223 384.4881 403.7288 415.0254 419.3314 424.1333 453.5424 459.7177 506.7977 524.8572 539.9911 545.7983 597.3660 605.2310 618.3391 641.9504 657.0024 663.8069 671.6671 695.2175 724.4684 726.9663 732.1606 793.0011 799.1257 815.0127 823.2458 835.0809 840.2301 855.3493 865.0993 869.8504 910.3096 929.7963 954.6908 962.9586 965.7013 973.6393 984.6149 994.5115 997.4878 1041.1583 1047.9067 1048.9091 1119.9192 1144.0125 1147.8099 1182.1121 1190.0189 1214.5118 1223.9736 1249.9721 1262.0094 1264.3371 1275.7977 1295.4067 1332.6884 1367.3973 1368.7562 1392.0137 1392.2463 1406.4718 1425.2925 1448.2359 1463.3644 1468.5376 1473.9307 1481.8850 1500.6034 1571.5499 1591.4187 1594.1705 1597.9384 1630.5589 1632.1437 2998.3780 3032.1973 3099.0342 3102.4972 3117.6749 3124.7929 3141.8595 3150.0146 3159.7934 3162.2973 3185.5961 3197.1546 3378.4688 3516.7307 3533.1915
redmass: 7.8284 6.8160 5.1991 2.8441 1.3497 7.8098 5.2848 4.4804 7.3693 6.1299 4.0022 5.8862 8.6239 7.3889 6.0056 10.7587 7.2405 5.5726 7.1374 6.5670 7.6651 5.9579 6.0113 4.9404 5.5611 6.4049 6.8467 2.9816 3.7274 6.8277 5.2243 4.8219 4.1370 2.9163 2.5483 4.5829 3.1362 4.3525 6.9913 5.6912 1.1908 6.0046 6.1797 1.7786 3.2372 2.8605 3.6460 3.5425 2.9724 2.5226 4.3666 1.4333 1.5991 4.4028 1.4382 1.8788 1.8897 6.1071 3.5606 1.3614 1.8250 3.1302 4.6732 1.6700 1.3382 1.6403 5.5025 2.4499 1.3132 1.4267 1.1823 1.1267 1.6430 3.4053 1.2840 1.3047 1.7286 1.8838 3.0278 1.4136 3.4224 2.8448 3.4656 3.3461 1.2337 4.6891 1.0850 1.0449 3.4872 1.2293 1.8945 2.5367 2.2525 7.5556 6.7709 6.0434 5.6208 5.3910 4.8758 1.0364 1.0632 1.0990 1.0996 1.0914 1.0898 1.1010 1.0904 1.0948 1.0918 1.0959 1.0953 1.0755 1.0759 1.0768
irintensity: 0.4849 0.4750 5.8963 1.2165 1.2098 2.8757 0.5187 5.7029 1.7211 4.8894 4.8146 7.9675 5.7745 2.0534 4.0648 3.4675 5.0739 13.9454 11.7681 3.9182 1.8253 2.4831 19.6509 3.6666 3.7576 7.5267 38.3436 0.0257 6.0268 3.3433 82.4781 14.4911 17.2767 81.0405 12.0733 73.4760 1.5685 2.3510 2.4963 3.6058 54.2312 2.2818 1.7684 63.9950 1.2659 0.9685 20.9973 4.8898 35.7289 164.0495 23.8535 18.3377 82.7754 4.0972 30.7076 46.7587 9.2909 3.0518 34.9524 2.1689 11.3970 8.2184 6.6918 14.4634 4.5787 14.7208 29.3709 35.0073 11.5972 3.0496 20.9976 31.2671 5.1137 68.4782 3.3648 22.1361 14.7437 56.2425 12.8735 53.3754 172.3031 59.8464 186.3682 8.3294 49.9351 13.9266 15.9600 15.3837 31.1037 14.9356 41.4653 83.1363 398.7495 66.7449 86.5023 5.3735 35.3108 459.8165 93.9457 9.5852 8.7373 9.9658 11.1889 6.1121 14.2195 0.2985 3.8656 4.2426 4.9717 0.5656 9.4035 17.0693 25.8153 17.4937
temp: 298.150 k
press: 1.00000 atm
elementType: 16 16 8 8 8 8 7 7 7 6 6 6 6 6 6 6 6 6 6 6 6 6 6 6 6 1 1 1 1 1 1 1 1 1 1 1 1 1 1 1
symmnumber: 1
zpe: 757400.4 jmol-1
zpe.correction: 0.288479 hartree
zpe.thermalcorrener: 0.312693 hartree
zpe.thermalcorrenthalpy: 0.313637 hartree
zpe.thermalcorrgfe: 0.230412 hartree
zpe.sumelectzpe: -1878.045479 hartree
zpe.sumelectthermal: -1878.021265 hartree
zpe.sumelectthermalent: -1878.020321 hartree
zpe.sumelectthermalfe: -1878.103546 hartree
dipole: 4.3543 5.3819 3.5424
dipole: 7.7765
quadrupole: -148.9747 -191.9782 -158.5557
quadrupole: 30.5129 21.5436 -3.6434
quadrupole: 17.5281 -25.4753 7.9472 30.5129 21.5436 -3.6434
hfenergy: -1878.333958 hartree
pointgroup: C01 [X(C16H15N3O4S2)]
dipole: -1.5941679 2.1540542 -1.4762188 debye
polarizability: 298.345626|33.5340626|334.2625431|39.3311594|3.5250549|216.5023871 unknown
InChI: InChI=1S/C16H15N3O4S2/c1-10(20)17-11-2-5-13(6-3-11)25(22,23)19-12-4-7-15-14(8-12)18-16(21)9-24-15/h2-8,17-19H,9H2,1H3
charge 0 multiplicity 1
40 atoms
S  -1.094095 -3.302305 -0.047674
S  4.3852 1.056245 1.661256
O  -1.842144 -4.277066 -1.112632
O  -0.919145 -3.655506 1.525773
O  4.206692 3.097245 -1.704182
O  -3.004059 3.317662 1.430873
N  0.747308 -3.16868 -0.759227
N  3.293695 1.017915 -1.24426
N  -3.714093 2.179903 -0.497142
C  1.543487 -2.134675 -0.205634
C  2.816331 -0.03663 -0.419347
C  -1.895779 -1.600055 -0.159826
C  3.223045 -0.152183 0.940407
C  1.948923 -1.006854 -0.97003
C  1.969189 -2.253652 1.148701
C  2.781725 -1.253687 1.710934
C  -1.704433 -0.687684 0.891471
C  -2.66491 -1.305699 -1.299964
C  3.800975 2.542162 0.645913
C  3.807882 2.25477 -0.850666
C  -3.080103 0.920241 -0.340072
C  -2.298492 0.587577 0.802776
C  -3.263292 -0.035873 -1.380952
C  -3.665331 3.295295 0.354149
C  -4.482079 4.493004 -0.119978
H  0.588218 -3.093764 -1.7815
H  1.59583 -0.891333 -2.003346
H  1.656575 -3.124616 1.73029
H  3.099046 -1.335974 2.755557
H  3.235448 0.89204 -2.25946
H  -1.123981 -0.973833 1.774182
H  -2.815949 -2.06079 -2.078165
H  4.500626 3.364319 0.849928
H  2.787608 2.820676 0.983431
H  -2.172941 1.32346 1.598274
H  -3.879997 0.213797 -2.253187
H  -4.27914 2.285909 -1.342694
H  -4.979001 4.344706 -1.094166
H  -3.819533 5.372536 -0.188439
H  -5.250304 4.723999 0.638126
