program: Gaussian 09
title: 000252661
version: EM64L-G09RevD.01
frameworkgroup: C1[X(C12H15ClO)]
method: RPBEPBE
basis: SDD
operation: Freq
keyword: #p
keyword: freq=noraman
keyword: PBEPBE/SDD
title: #p freq=noraman PBEPBE/SDD
converged: NO NO NO NO
title: Mulliken charges:
elementType: Cl O C C C C C C C C C C C C H H H H H H H H H H H H H H H
charge: -0.076014 -0.414045 -0.219586 -0.438583 -0.438583 -0.396965 -0.396963 -0.383451 0.600332 -0.383483 -0.479399 -0.313961 -0.319336 0.346803 0.204368 0.217265 0.194445 0.194451 0.217264 0.192452 0.202113 0.202113 0.192451 0.188585 0.201175 0.255946 0.239399 0.253676 0.357530
chargesum: 0.00000
title: Mulliken charges with hydrogens summed into heavy atoms:
elementType: Cl O C C C C C C C C C C C C
charge: -0.076014 -0.056515 -0.015218 -0.026874 -0.026868 -0.002400 -0.002399 0.006309 0.600332 -0.127537 -0.240000 -0.313961 -0.065660 0.346803
polarizability: 1.89220407e+02 3.39146226e+00 1.38898870e+02 -1.00742293e-03 -7.46667304e-04 9.00648293e+01
1716.lowfreq: -9.8173 -6.4677 0.0014 0.0018 0.0024 9.7757 27.6557 65.4124 70.8778
frequency: 27.6372 65.2874 70.8641 149.9566 169.6082 209.0118 224.3809 246.9684 255.1365 318.7071 367.8672 386.5862 427.7696 433.4563 442.1243 445.6365 467.4115 496.7832 568.1531 589.5797 670.1576 712.5674 757.7277 778.6151 802.7133 825.5909 838.6169 866.7347 872.6209 891.3580 895.6875 920.3204 955.3960 992.4243 1021.6798 1048.2843 1050.2727 1068.5507 1110.1499 1113.1907 1139.6010 1170.2031 1180.7700 1199.3928 1227.1132 1248.9802 1256.8168 1261.9969 1283.2684 1303.0258 1312.3175 1325.2088 1330.5254 1340.2001 1340.3366 1352.3727 1390.6204 1416.3051 1455.7730 1458.6198 1458.7277 1465.0220 1471.8875 1484.5114 1580.9872 1616.7346 2953.7303 2962.4646 2963.7080 2964.1768 2965.1576 2970.8561 3025.4990 3028.2306 3032.2894 3033.3571 3043.7941 3133.0251 3150.0001 3169.4048 3498.9213
redmass: 3.7411 3.8113 4.3002 5.0845 3.9213 1.8162 4.9861 4.4065 6.4670 2.1825 3.8188 5.0997 2.9813 2.4684 3.5766 1.2273 1.9854 2.7539 4.1586 4.0542 6.7622 3.4324 2.8886 1.4701 3.7127 1.4382 2.3558 1.5226 2.0181 1.4185 3.0611 1.9424 1.3848 2.6122 2.8079 1.8214 1.2925 1.2956 2.4767 1.7472 1.8425 1.3797 1.4621 1.6686 1.3606 2.0411 1.2928 1.3151 1.8788 1.2474 1.4092 1.3308 1.3769 1.4928 1.5174 1.5154 4.5704 2.8132 1.0882 1.0878 1.0932 1.0844 1.1051 3.1715 6.1387 7.4796 1.0788 1.0654 1.0661 1.0593 1.0615 1.0656 1.0962 1.0958 1.0988 1.1027 1.1034 1.0893 1.0915 1.0953 1.0648
irintensity: 0.0007 0.0353 0.0604 0.0033 0.1061 0.1306 0.2938 3.4185 2.4923 0.7508 1.5683 0.1529 9.5392 43.4488 11.0563 99.8296 0.7349 8.1341 15.8854 9.4568 25.4140 3.4633 9.8105 0.6369 5.1130 38.8272 10.3047 17.0314 7.8185 2.7279 9.9932 0.9323 0.1161 17.5841 12.7399 0.8378 0.1445 0.0026 0.0004 15.6972 0.5425 221.0982 0.7956 15.1666 3.2891 22.1517 1.6415 1.8559 22.5207 0.2098 4.4097 0.0271 0.1516 0.4405 6.6302 5.5419 9.2782 18.8350 2.8445 8.8669 3.6568 17.4468 7.4909 149.0253 10.3346 8.8477 4.3685 44.2318 40.5382 0.1641 31.9108 55.4652 96.5352 79.1497 0.9298 2.9738 122.6985 11.5573 3.8455 5.4269 57.3257
temp: 298.150 k
press: 1.00000 atm
elementType: 17 8 6 6 6 6 6 6 6 6 6 6 6 6 1 1 1 1 1 1 1 1 1 1 1 1 1 1 1
symmnumber: 1
zpe: 631158.8 jmol-1
zpe.correction: 0.240396 hartree
zpe.thermalcorrener: 0.253409 hartree
zpe.thermalcorrenthalpy: 0.254353 hartree
zpe.thermalcorrgfe: 0.200065 hartree
zpe.sumelectzpe: -1000.515198 hartree
zpe.sumelectthermal: -1000.502185 hartree
zpe.sumelectthermalent: -1000.501241 hartree
zpe.sumelectthermalfe: -1000.555529 hartree
dipole: 2.1254 0.0022 0.0000
dipole: 2.1254
quadrupole: -90.4121 -88.7826 -93.8142
quadrupole: 3.2707 -0.0002 -0.0002
quadrupole: 0.5908 2.2204 -2.8112 3.2707 -0.0002 -0.0002
hfenergy: -1000.7555938 hartree
pointgroup: C01 [X(C12H15Cl1O1)]
dipole: -0.8327602 -0.0756638 -0.0001019 debye
polarizability: 188.2135291|7.8202144|139.9057419|0.0128347|0.0151673|90.064835 unknown
InChI: InChI=1S/C12H15ClO/c13-11-8-10(6-7-12(11)14)9-4-2-1-3-5-9/h6-9,14H,1-5H2
charge 0 multiplicity 1
29 atoms
Cl 3.071505 2.452725 0.001035
O  4.395788 -0.321575 0.000372
C  -1.392413 -0.539488 -0.000353
C  -2.013759 0.1030 -1.275677
C  -2.013966 0.102071 1.27534
C  -3.55698 -0.007633 -1.275593
C  -3.557188 -0.008555 1.274926
C  -4.167143 0.621123 -0.000157
C  0.132223 -0.467296 -0.000181
C  0.798639 0.786282 0.000273
C  0.928286 -1.642776 -0.000434
C  2.199786 0.833023 0.000453
C  2.336639 -1.5860 -0.000246
C  2.997407 -0.337493 0.000203
H  -1.678767 -1.612961 -0.000766
H  -1.590017 -0.377682 -2.178391
H  -1.725117 1.173912 -1.318832
H  -1.725312 1.172945 1.319328
H  -1.590375 -0.37928 2.177769
H  -3.845955 -1.078265 -1.327309
H  -3.969828 0.479243 -2.180267
H  -3.970183 0.477663 2.179886
H  -3.846172 -1.079225 1.325813
H  -3.964758 1.712574 0.000253
H  -5.267407 0.497839 -0.000291
H  0.230503 1.722183 0.000483
H  0.435297 -2.621916 -0.00079
H  2.950967 -2.491312 -0.000444
H  4.723001 0.617475 0.000693
