program: Gaussian 09
title: 000023683
version: EM64L-G09RevD.01
frameworkgroup: C1[X(C8H16O2)]
method: RPBEPBE
basis: SDD
operation: Freq
keyword: #pfreq=noraman
keyword: PBEPBE/SDD
title: #p freq=noraman PBEPBE/SDD
converged: YES YES NO NO
title: Mulliken charges:
elementType: O O C C C C C C C C H H H H H H H H H H H H H H H H
charge: -0.272845 -0.272846 -0.315148 -0.315146 -0.187937 -0.187938 -0.204242 -0.204242 -0.677702 -0.677701 0.202742 0.187498 0.202742 0.187499 0.240306 0.240307 0.184265 0.184415 0.184265 0.184415 0.200230 0.231098 0.227318 0.200231 0.231098 0.227318
chargesum: 0.00000
title: Mulliken charges with hydrogens summed into heavy atoms:
elementType: O O C C C C C C C C
charge: -0.272845 -0.272846 0.075092 0.075095 0.052369 0.052370 0.164438 0.164438 -0.019056 -0.019055
polarizability: 1.43145572e+02 -1.06742594e-04 7.75093932e+01 3.34498711e+00 -1.45041318e-04 7.98766003e+01
1716.lowfreq: -3.2059 0.0008 0.0009 0.0010 3.9079 11.4137 25.7722 53.0940 54.1616
frequency: 25.7716 53.0905 54.1586 78.3739 88.4600 123.6112 133.8135 138.4545 233.4783 241.6173 246.3219 260.8290 270.4271 419.0054 445.0817 453.5186 538.5786 776.3530 816.7782 817.0288 832.5695 857.3178 946.3158 972.4733 985.7846 991.0241 995.7867 1059.7783 1066.4705 1098.6646 1108.3200 1128.7112 1132.1389 1135.7110 1147.9635 1178.1782 1204.5010 1250.5335 1250.6593 1269.0084 1281.3988 1325.5204 1337.1913 1385.0657 1389.0064 1399.0146 1405.1043 1459.0216 1459.0345 1466.1189 1467.0512 1480.0773 1480.0984 1492.5037 1492.6785 1700.9626 2889.9842 2890.1983 2911.5606 2912.0751 2955.4284 2955.7440 2957.1258 2957.3494 2993.7661 2993.8594 3091.2577 3091.2904 3101.7253 3101.7405 3103.5124 3111.2760
redmass: 3.2910 2.1135 1.7867 2.9520 4.3003 2.5373 2.6708 2.5385 1.9851 1.1728 1.4366 2.6656 4.0824 3.4837 3.1907 2.7296 2.6497 1.8193 1.0884 1.0905 2.9019 2.1893 1.6310 2.8884 2.8763 1.3113 1.9726 4.0295 4.7515 2.7954 2.1026 2.4143 1.6211 1.4008 1.8831 1.1274 1.1656 1.1500 1.1503 1.1991 1.2771 1.2096 1.2770 1.2688 1.2476 1.3801 1.4845 1.0410 1.0410 1.0874 1.0873 1.0501 1.0504 1.0759 1.0763 6.7473 1.0603 1.0604 1.0555 1.0556 1.0987 1.1003 1.1049 1.1038 1.0358 1.0358 1.0990 1.0990 1.1009 1.1009 1.0959 1.0861
irintensity: 0.0013 6.4868 4.6800 0.9835 0.9189 4.4638 5.9969 3.0217 1.0749 0.5820 0.0144 1.4406 0.1137 0.1775 0.0005 12.1394 0.6188 3.4808 3.4885 5.7178 4.1559 11.4092 3.7884 41.5209 75.4076 20.9914 28.9345 263.4076 21.1827 6.5760 0.3282 44.3950 3.1527 4.7007 5.3097 11.2000 3.1052 0.0573 0.1426 10.2242 0.1527 3.6150 97.3439 3.9810 32.0604 17.9328 0.5959 11.7972 9.6329 14.9015 0.0747 8.6433 0.0798 5.9998 5.4088 0.5303 5.4516 85.2371 130.6444 83.3861 174.8401 52.2843 5.4800 10.4824 38.5380 14.2447 72.2902 3.6575 39.4057 35.0630 0.3322 33.3271
temp: 298.150 k
press: 1.00000 atm
elementType: 8 8 6 6 6 6 6 6 6 6 1 1 1 1 1 1 1 1 1 1 1 1 1 1 1 1
symmnumber: 1
zpe: 591340.4 jmol-1
zpe.correction: 0.225230 hartree
zpe.thermalcorrener: 0.238553 hartree
zpe.thermalcorrenthalpy: 0.239498 hartree
zpe.thermalcorrgfe: 0.183456 hartree
zpe.sumelectzpe: -464.002020 hartree
zpe.sumelectthermal: -463.988697 hartree
zpe.sumelectthermalent: -463.987753 hartree
zpe.sumelectthermalfe: -464.043794 hartree
dipole: 0.0000 -2.0061 0.0000
dipole: 2.0061
quadrupole: -48.4940 -62.9633 -60.8250
quadrupole: -0.0001 -6.3763 -0.0001
quadrupole: 8.9334 -5.5359 -3.3975 -0.0001 -6.3763 -0.0001
hfenergy: -464.2272501 hartree
pointgroup: C01 [X(C8H16O2)]
dipole: 0.0000097 -0.7892429 0.000036 debye
dipolederiv: -1.2088779 0.2426612 -0.008539 0.3348401 -0.5291538 -0.0047223 0.0412716 -0.0053279 -0.4015738 -1.208866 -0.2426762 -0.0085076 -0.3348437 -0.529164 0.0047393 0.0413164 0.0053441 -0.4015754 0.6767669 -0.1237977 0.1185313 -0.385445 0.5823749 0.0200018 0.1604172 -0.0402264 0.3369106 0.6767492 0.1238159 0.1185174 0.3854634 0.5823886 -0.0200334 0.1603854 0.040196 0.3369056 -0.0292547 0.0325906 -0.0053347 0.0221346 -0.2466828 -0.0068439 -0.0235902 0.027662 0.1118261 -0.02923 -0.0325844 -0.0053322 -0.0221385 -0.246681 0.0068971 -0.0235925 -0.0276066 0.1118282 0.8990552 -0.0831893 -0.0477298 0.0341701 0.3665864 0.0770805 -0.2088274 0.1259693 0.3854799 0.8990511 0.0831922 -0.0477417 -0.034179 0.3665677 -0.0770797 -0.2088292 -0.1259726 0.3855041 -0.0846587 0.0898368 -0.0474952 0.0866501 -0.0283868 0.0427078 -0.0267026 0.0417997 0.031528 -0.0846554 -0.0898427 -0.0474844 -0.0866548 -0.0283993 -0.0427015 -0.0266921 -0.0417929 0.0315386 -0.0122172 0.0331034 -0.0396543 0.0621857 0.017348 -0.0482971 -0.0611919 0.0138178 -0.2030459 -0.1608486 -0.1263051 -0.0072212 0.0072696 -0.1969565 0.0068309 -0.0363213 -0.0213777 0.0515982 -0.0122163 -0.0331083 -0.0396479 -0.0621931 0.0173504 0.0482713 -0.0611839 -0.0138421 -0.2030498 -0.1608524 0.1263018 -0.0072358 -0.0072751 -0.196957 -0.0068019 -0.0363215 0.0214046 0.0515966 0.0661872 -0.0000556 0.0165043 -0.0535821 0.1637686 0.0087766 0.0377917 0.0007821 -0.1066997 0.0661882 0.000054 0.0165043 0.0535846 0.1637682 -0.0088157 0.0377835 -0.0008228 -0.1066956 -0.1018536 -0.0321734 0.0045189 -0.1485281 -0.2164433 -0.009826 0.0236588 -0.0467507 0.0412151 -0.0594854 0.0247658 -0.0442638 0.005207 0.0398768 -0.0272758 0.0862716 -0.0383481 -0.2488121 -0.1018572 0.0321764 0.0045169 0.1485325 -0.216434 0.0098508 0.0236445 0.0467772 0.041209 -0.0594829 -0.0247715 -0.0442655 -0.0051995 0.0398832 0.0272454 0.0862682 0.0383206 -0.2488193 -0.1822763 0.0317406 0.0720821 0.0187964 0.0870038 0.0176281 0.0899945 0.0103549 0.0656018 0.0792813 -0.1096589 -0.0174019 -0.054968 -0.1142411 -0.01998 -0.0386897 -0.0283905 0.0854615 0.1181745 0.0006407 0.0060042 0.0104638 0.0749044 -0.0502807 -0.0440813 -0.0165157 -0.1494923 -0.1822723 -0.0317385 0.0720889 -0.0187923 0.0870001 -0.0176289 0.0900006 -0.0103548 0.0656021 0.0792773 0.1096615 -0.0174132 0.0549682 -0.1142325 0.0199993 -0.0386957 0.0284084 0.0854573 0.1181739 -0.0006392 0.0059997 -0.0104668 0.0749111 0.0502581 -0.0440847 0.0164919 -0.1494987 unknown
polarizability: 143.1306017|0.0008639|77.5093932|3.4836569|0.0003141|79.8915705 unknown
InChI: InChI=1S/C8H16O2/c1-3-9-7-5-6-8-10-4-2/h5-6H,3-4,7-8H2,1-2H3
charge 0 multiplicity 1
26 atoms
O  -2.80741 0.234761 -0.199063
O  2.807414 0.234824 0.199075
C  -1.92562 -0.774001 0.410209
C  1.925632 -0.77401 -0.410085
C  -0.603686 -0.729684 -0.308493
C  0.603695 -0.729617 0.308607
C  -4.167715 0.189648 0.35677
C  4.167712 0.189679 -0.35677
C  -4.988649 1.266051 -0.352631
C  4.988636 1.26617 0.352509
H  -1.793559 -0.577668 1.497376
H  -2.396908 -1.780461 0.300327
H  1.793575 -0.577802 -1.497275
H  2.396924 -1.780457 -0.300088
H  -0.670961 -0.713992 -1.405771
H  0.67097 -0.713754 1.405883
H  -4.608136 -0.821019 0.194222
H  -4.135023 0.373605 1.454602
H  4.608153 -0.820963 -0.194124
H  4.135002 0.373523 -1.454621
H  -6.02624 1.276813 0.028557
H  -4.541834 2.261402 -0.187139
H  -5.014985 1.076357 -1.439563
H  6.026221 1.276913 -0.028696
H  4.541799 2.261495 0.186922
H  5.014992 1.076587 1.43946
