program: Gaussian 09
title: 000260858
version: EM64L-G09RevD.01
frameworkgroup: C1[X(C8H3ClN2O)]
method: RPBEPBE
basis: SDD
operation: Freq
keyword: #p
keyword: freq=noraman
keyword: PBEPBE/SDD
title: #p freq=noraman PBEPBE/SDD
converged: NO YES NO NO
title: Mulliken charges:
elementType: Cl O N N C C C C C C C C H H H
charge: 0.070522 -0.197490 0.006970 0.004691 0.397633 -0.355743 -0.183794 -0.058205 -0.370859 0.319969 -0.243978 -0.211950 0.271775 0.280588 0.269872
chargesum: 0.00000
title: Mulliken charges with hydrogens summed into heavy atoms:
elementType: Cl O N N C C C C C C C C
charge: 0.070522 -0.197490 0.006970 0.004691 0.397633 -0.083968 0.096794 -0.058205 -0.100987 0.319969 -0.243978 -0.211950
polarizability: 2.17617807e+02 1.11824788e+01 1.23802303e+02 -8.02228466e-04 -7.17582166e-04 4.18020355e+01
1716.lowfreq: -0.0023 -0.0018 -0.0008 1.7979 4.1152 6.0112 42.3791 71.4799 91.4988
frequency: 42.3719 71.4795 91.4969 132.4495 169.2538 184.2620 241.9845 300.7282 363.5562 393.4006 429.8423 456.1590 486.1856 596.4795 596.6974 637.1298 660.1965 750.1466 788.7154 796.8217 872.0171 902.2730 910.0307 918.4306 1026.0154 1109.5499 1135.2488 1194.9810 1286.5667 1319.6122 1357.5936 1459.3257 1513.9558 1627.1674 2165.8885 2177.7792 3146.4159 3225.2950 3255.0871
redmass: 11.6861 14.7473 6.7103 12.3053 13.1985 9.6417 7.7240 9.7150 4.5254 6.8262 10.2685 9.7742 11.0795 12.3441 4.9441 6.5031 4.8861 7.1696 6.3417 1.2453 1.3688 9.4799 6.2084 1.4268 1.3400 3.7666 4.1450 1.7074 6.5018 2.2693 2.2141 8.5582 6.0331 7.5170 12.6234 12.6340 1.0902 1.0963 1.1032
irintensity: 0.2202 0.6368 0.0280 4.5670 0.4431 9.4358 1.2711 0.5136 0.3032 0.7607 12.3455 0.0003 4.7630 0.1942 0.0708 0.4869 4.1039 1.6388 11.7509 64.5306 1.9270 21.2994 0.3781 28.1346 46.5585 32.0141 13.2491 5.2645 14.1849 7.0904 43.4044 212.0263 42.3053 163.9462 11.2967 37.0003 0.9995 0.8035 1.4978
temp: 298.150 k
press: 1.00000 atm
elementType: 17 8 7 7 6 6 6 6 6 6 6 6 1 1 1
symmnumber: 1
zpe: 232031.2 jmol-1
zpe.correction: 0.088376 hartree
zpe.thermalcorrener: 0.099032 hartree
zpe.thermalcorrenthalpy: 0.099976 hartree
zpe.thermalcorrgfe: 0.050399 hartree
zpe.sumelectzpe: -950.537249 hartree
zpe.sumelectthermal: -950.526593 hartree
zpe.sumelectthermalent: -950.525649 hartree
zpe.sumelectthermalfe: -950.575226 hartree
dipole: -5.2521 -5.5251 0.0000
dipole: 7.6230
quadrupole: -90.3979 -73.7171 -75.5860
quadrupole: 0.5811 -0.0018 -0.0006
quadrupole: -10.4975 6.1832 4.3143 0.5811 -0.0018 -0.0006
hfenergy: -950.625625 hartree
pointgroup: C01 [X(C8H3Cl1N2O1)]
dipole: 2.2565992 -1.9753868 0.0205742 debye
dipolederiv: -0.4565763 -0.2289536 -0.0004795 -0.6069066 -0.3425443 0.0001334 0.0018529 0.0015495 0.0498972 -0.3427538 -0.0318063 -0.0008112 0.0922435 -0.5691343 0.0034024 -0.0016164 0.0029663 -0.0626815 -0.4591848 -0.0057639 -0.0008227 -0.0839259 -0.19391 -0.0005096 -0.000369 -0.0002217 -0.2259982 -0.1377762 0.0234262 0.000184 0.1728174 -0.2087717 0.0005588 -0.0007472 0.0000017 -0.2242481 -0.8778919 0.0620857 -0.0038238 0.2445986 0.266454 -0.0003987 -0.0048017 -0.0011304 0.0460176 0.711984 0.044773 0.0029748 -0.0212177 0.0129099 -0.0011252 0.003319 -0.0008745 -0.1602677 -0.3270514 -0.1143514 0.0000242 -0.789935 -0.2386425 -0.0024258 0.0041369 0.0001223 -0.1518168 0.5017763 0.435863 -0.0008531 1.0251647 0.8875945 -0.0015916 -0.004408 -0.0038222 -0.0033492 1.198476 -0.2905731 0.0065048 -0.3588343 0.0605761 -0.0021133 0.0068694 -0.0018339 -0.0622061 -0.4160646 0.1112443 -0.0027609 0.5521961 0.1521597 0.0019843 -0.0054489 0.0003252 0.1395571 0.5397261 0.0361024 0.0016665 0.1113132 -0.1206217 0.0013776 0.0012202 0.0011044 0.0346759 -0.1452115 -0.0054156 -0.0007493 -0.2528427 0.1228136 -0.0013343 0.0007816 -0.0004074 0.0615197 0.113585 -0.0595044 0.0000638 -0.0473185 0.0289927 0.0008267 -0.0000057 0.0007755 0.1949596 0.0284333 0.0293676 -0.0008338 0.0160869 0.1300885 0.0005298 -0.0007559 0.000581 0.2083048 0.0685296 -0.006494 -0.0002837 -0.0534397 0.0120354 0.0006855 -0.0000271 0.0008641 0.1556357 unknown
polarizability: 218.8678468|-2.4398609|122.5466323|0.6778686|-0.5043519|41.8076666 unknown
InChI: InChI=1S/C8H3ClN2O/c9-8-2-1-7(12-8)3-6(4-10)5-11/h1-3H
charge 0 multiplicity 1
15 atoms
Cl 3.671503 1.541222 0.007405
O  1.242965 0.38473 0.005606
N  -4.319917 -0.625588 -0.009332
N  -1.254541 2.594246 -0.017567
C  0.615133 -0.894241 0.01105
C  1.612347 -1.8823 0.020672
C  2.887177 -1.225765 0.021349
C  2.612762 0.137246 0.012091
C  -0.807279 -1.001476 0.006374
C  -1.761701 0.009947 -0.003484
C  -3.158083 -0.337443 -0.006656
C  -1.461149 1.41577 -0.011073
H  1.437608 -2.956864 0.02651
H  3.872689 -1.683222 0.027701
H  -1.178715 -2.033064 0.011352
