program: Gaussian 09
title: 000252635
version: EM64L-G09RevD.01
frameworkgroup: C1[X(C9H15O6P)]
method: RPBEPBE
basis: SDD
operation: Freq
keyword: #p
keyword: freq=noraman
keyword: PBEPBE/SDD
title: #p freq=noraman PBEPBE/SDD
converged: YES YES NO NO
title: Mulliken charges:
elementType: P O O O O O O C C C C C C C C C H H H H H H H H H H H H H H H
charge: 1.392832 -0.498235 -0.479861 -0.501437 -0.562044 -0.222730 -0.172321 0.184656 0.139619 -0.726040 -0.747444 0.177471 0.236045 -0.750883 -0.773516 -0.487166 0.250119 0.241697 0.263127 0.233257 0.247575 0.255973 0.281442 0.259339 0.246868 0.276586 0.243993 0.258588 0.242103 0.256965 0.233421
chargesum: 0.00000
title: Mulliken charges with hydrogens summed into heavy atoms:
elementType: P O O O O O O C C C C C C C C C
charge: 1.392832 -0.498235 -0.479861 -0.501437 -0.562044 -0.222730 -0.172321 0.184656 0.139619 0.028903 -0.010638 0.177471 0.236045 0.036766 0.005651 0.245323
polarizability: 1.64178448e+02 -1.39441343e+00 1.17197973e+02 8.51017107e+00 4.89966168e+00 1.26095571e+02
1716.lowfreq: -5.8749 -0.0015 -0.0012 -0.0011 5.1553 9.8651 38.7989 51.0088 62.1593
frequency: 38.6442 50.9922 62.1191 72.5586 79.3853 94.3137 126.5096 133.7331 171.6478 174.4154 176.8242 199.6429 210.6291 242.5134 254.8744 263.6149 272.7184 292.8026 302.4595 308.6960 328.0058 339.8972 379.9551 400.5847 441.5450 453.7931 527.3539 540.2820 561.6485 577.7975 603.0828 609.2552 635.2773 697.0732 715.3320 768.3866 827.3924 860.7932 877.5397 959.4700 963.8783 965.9303 996.9053 1020.6698 1063.6083 1072.6785 1093.6917 1100.3200 1112.9908 1121.1474 1133.2225 1138.2870 1180.2477 1228.7352 1247.0637 1374.7875 1375.9598 1381.4739 1393.9847 1427.0805 1431.3706 1431.8219 1438.4100 1450.6717 1459.1867 1459.5129 1465.7667 1474.5924 1478.5321 1489.3841 1616.0202 1624.9092 2989.0597 2991.9755 2993.4873 3000.2549 3008.7861 3071.9769 3073.9157 3099.4895 3100.2624 3106.4602 3115.5475 3120.4673 3125.3575 3131.4830 3131.6006
redmass: 4.4674 2.4710 4.3952 1.7536 2.1842 5.0127 5.7455 5.0730 2.1807 1.2716 1.1409 3.5285 6.1298 1.9797 3.0224 2.5871 1.4098 2.0716 3.8943 3.2607 2.2503 5.7421 7.7683 4.5652 4.3080 5.7594 5.9029 3.2082 4.0850 5.0243 3.1613 4.8808 5.6057 6.3060 8.2451 3.4780 2.8605 4.0402 2.5989 1.9796 3.8274 2.5163 1.9243 1.6524 3.8381 3.7162 1.8847 2.1758 1.2480 2.2615 2.8790 1.3217 6.0534 3.7548 4.0384 1.2459 1.2342 1.1938 1.1985 1.1185 1.0513 1.0899 1.0673 1.0524 1.0511 1.0503 1.0581 1.0521 1.0509 1.0495 8.0920 8.3084 1.0369 1.0367 1.0289 1.0346 1.0360 1.0940 1.0955 1.1056 1.1005 1.1004 1.1010 1.0997 1.1008 1.1027 1.1046
irintensity: 3.1165 7.4434 2.5591 3.0250 1.4028 2.2614 2.5158 6.6425 3.2206 1.8904 0.3844 1.2066 7.8733 6.3166 9.5794 1.3906 4.5888 4.8177 0.1182 4.4867 4.2121 5.6707 9.3229 6.9710 17.7357 24.2439 12.3031 0.5051 7.3371 17.3446 9.6115 30.6619 31.2603 84.6135 209.6788 2.9941 34.2514 144.9277 18.9201 49.8311 144.0270 65.4134 26.1613 2.1534 144.1908 44.1905 20.4624 62.5769 2.8431 17.8010 4.0857 0.9656 11.1752 39.7544 45.4437 91.0278 43.9431 21.6870 52.0071 2.9010 24.9428 34.3551 30.0860 2.1968 5.7003 41.8728 4.1335 11.9781 19.4759 11.9031 24.7651 117.9201 1.3536 0.3403 55.1791 5.9827 8.8935 1.9114 1.7832 19.1502 14.6468 7.8596 7.0099 15.1000 4.0139 16.3699 10.0217
temp: 298.150 k
press: 1.00000 atm
elementType: 15 8 8 8 8 8 8 6 6 6 6 6 6 6 6 6 1 1 1 1 1 1 1 1 1 1 1 1 1 1 1
symmnumber: 1
zpe: 615517.7 jmol-1
zpe.correction: 0.234438 hartree
zpe.thermalcorrener: 0.253692 hartree
zpe.thermalcorrenthalpy: 0.254636 hartree
zpe.thermalcorrgfe: 0.187498 hartree
zpe.sumelectzpe: -1143.233526 hartree
zpe.sumelectthermal: -1143.214273 hartree
zpe.sumelectthermalent: -1143.213329 hartree
zpe.sumelectthermalfe: -1143.280467 hartree
dipole: 0.8335 2.5471 2.6139
dipole: 3.7437
quadrupole: -94.1617 -104.1316 -104.1924
quadrupole: -12.5296 -3.3846 -8.1425
quadrupole: 6.6669 -3.3030 -3.3638 -12.5296 -3.3846 -8.1425
hfenergy: -1143.4679647 hartree
pointgroup: C01[X(C9H15O6P1)]
dipole: -0.2921074 1.1064003 -0.9273015 debye
polarizability: 163.8059579|-0.0329301|118.2782869|9.3435441|-5.8279878|125.3877472 unknown
InChI: InChI=1S/C9H15O6P/c1-6(10)8(3)9(4,7(2)11)15-16(12,13-5)14-8/h1-5H3
charge 0 multiplicity 1
31 atoms
P  1.777618 -0.421024 0.340529
O  0.605132 0.755234 0.917784
O  0.787407 -0.924673 -1.011912
O  2.947243 0.469738 -0.568154
O  2.419697 -1.389876 1.409493
O  -2.812995 1.551297 0.004288
O  -0.797756 -1.9387 1.005411
C  -0.46817 0.976155 -0.091287
C  -0.608638 -0.420169 -0.880339
C  -0.053998 2.144575 -1.007585
C  -1.149801 -0.294122 -2.301865
C  -1.767606 1.336538 0.676802
C  -1.391773 -1.441446 0.014658
C  -1.709241 1.42192 2.18091
C  -2.827206 -1.784682 -0.327333
C  4.343504 0.534607 -0.066362
H  -0.881119 2.425376 -1.679472
H  0.202144 3.01566 -0.38054
H  0.838458 1.874234 -1.597831
H  -1.18628 -1.288005 -2.778946
H  -2.161563 0.144496 -2.29612
H  -0.488227 0.343856 -2.907636
H  -1.379047 0.453141 2.600076
H  -0.938872 2.150476 2.493285
H  -2.694626 1.705014 2.581075
H  -3.446648 -0.873204 -0.408723
H  -2.876345 -2.295508 -1.307353
H  -3.237417 -2.451371 0.446585
H  4.955017 0.719747 -0.96191
H  4.634728 -0.414903 0.414871
H  4.445782 1.368322 0.649703
