program: Gaussian 09
title: 000260861
version: EM64L-G09RevD.01
frameworkgroup: C1[X(C10H12O6)]
method: RPBEPBE
basis: SDD
operation: Freq
keyword: #pfreq=noraman
keyword: PBEPBE/SDD
title: #p freq=noraman PBEPBE/SDD
converged: YES YES NO NO
title: Mulliken charges:
elementType: O O O O O O C C C C C C C C C C H H H H H H H H H H H H
charge: -0.233425 -0.231595 -0.231582 -0.233397 -0.237013 -0.237030 0.096710 0.095263 0.095358 0.096581 0.082562 0.082648 -0.500166 -0.498977 -0.498996 -0.500093 0.259552 0.233437 0.220335 0.233107 0.221713 0.258451 0.233120 0.258468 0.221696 0.259472 0.220399 0.233405
chargesum: 0.00000
title: Mulliken charges with hydrogens summed into heavy atoms:
elementType: O O O O O O C C C C C C C C C C
charge: -0.233425 -0.231595 -0.231582 -0.233397 -0.237013 -0.237030 0.096710 0.095263 0.095358 0.096581 0.082562 0.082648 0.213157 0.214294 0.214288 0.213182
polarizability: 1.62399995e+02 -1.42541336e+00 2.17709151e+02 -1.48570398e-01 5.49643267e+00 7.21294450e+01
1716.lowfreq: -12.8914 -7.7745 -0.0006 -0.0006 0.0000 1.7435 5.7833 33.7870 54.8825
frequency: 4.9505 33.7870 54.8825 58.4107 58.8400 78.2170 94.2615 143.4110 145.6539 160.8812 170.3082 196.5503 201.3145 207.0405 229.6011 251.7642 311.2841 325.6261 353.1979 363.3070 381.0340 391.1982 423.9287 434.1869 460.1455 535.3840 544.7032 618.8379 716.8118 785.8976 795.8563 832.3493 863.6111 881.3408 909.9241 1014.1809 1075.0935 1098.7489 1099.7315 1100.0435 1100.3359 1110.5037 1132.5900 1140.8709 1148.3117 1160.7225 1239.3919 1254.0789 1257.2632 1342.4050 1427.4729 1429.7629 1433.3114 1437.1117 1451.7777 1453.1627 1453.6492 1453.9603 1457.5265 1458.5000 1459.8683 1461.1632 1510.1178 1511.7582 1546.2346 1620.7117 2998.0426 2998.3118 2999.3032 2999.9537 3109.4130 3109.4381 3110.3310 3110.3759 3135.9391 3135.9589 3137.3021 3137.4017
redmass: 2.5092 2.7905 4.6429 3.9713 3.2580 3.5055 2.9061 1.4764 1.2828 1.2598 1.4131 3.3945 2.5918 3.7887 5.9216 3.3667 9.6100 4.7978 4.8555 7.6877 6.0859 7.5869 4.9124 7.9184 11.0687 8.5085 8.2627 10.8042 11.6020 11.6006 8.3848 7.9365 8.8237 9.1197 9.9074 6.9122 11.2486 1.2745 1.2337 1.2380 1.2458 2.9262 1.3771 1.3569 1.4495 1.9393 7.0096 7.4677 6.6993 7.7081 1.2268 1.1806 1.2395 1.1791 1.0640 1.0619 1.0679 1.0721 1.0763 1.0542 1.0601 1.0728 8.4467 6.2096 7.8954 10.4024 1.0304 1.0305 1.0301 1.0304 1.1017 1.1017 1.1023 1.1022 1.1062 1.1061 1.1061 1.1061
irintensity: 0.0000 0.9340 20.1327 0.2148 19.5932 0.1445 0.0001 0.2622 0.0006 0.9347 0.0001 0.0001 1.3169 15.6714 25.6531 0.0000 0.0000 0.0000 4.8823 0.0000 0.0003 32.2196 11.6341 0.0001 0.0000 0.0001 5.6781 0.1594 17.4861 0.0000 0.0000 58.6040 0.0000 84.8202 0.0000 345.9573 70.2223 0.0001 7.0445 0.0097 6.6035 0.0001 0.0000 3.8099 87.0827 0.0000 0.0008 0.0037 831.7022 0.1527 48.3280 0.0061 209.6660 0.0012 30.8526 0.0118 0.0288 57.9589 66.4379 0.0169 87.3943 0.1612 0.0017 353.1268 419.7233 0.0001 0.2472 135.6972 96.2041 0.0051 68.8062 4.0060 76.6549 0.0337 30.4702 5.8049 26.6219 1.2885
temp: 298.150 k
press: 1.00000 atm
elementType: 8 8 8 8 8 8 6 6 6 6 6 6 6 6 6 6 1 1 1 1 1 1 1 1 1 1 1 1
symmnumber: 1
zpe: 543347.6 jmol-1
zpe.correction: 0.206950 hartree
zpe.thermalcorrener: 0.225207 hartree
zpe.thermalcorrenthalpy: 0.226151 hartree
zpe.thermalcorrgfe: 0.157401 hartree
zpe.sumelectzpe: -838.273622 hartree
zpe.sumelectthermal: -838.255365 hartree
zpe.sumelectthermalent: -838.254421 hartree
zpe.sumelectthermalfe: -838.323172 hartree
dipole: 0.0011 0.0006 0.0035
dipole: 0.0037
quadrupole: -89.1951 -80.2488 -92.3552
quadrupole: -0.3570 -0.1671 -9.0596
quadrupole: -1.9288 7.0176 -5.0888 -0.3570 -0.1671 -9.0596
hfenergy: -838.4805722 hartree
pointgroup: C01 [X(C10H12O6)]
dipole: 0.0004383 -0.0006458 -0.0012489 debye
polarizability: 162.3697017|0.5818747|207.6136497|-0.1375414|-37.4448384|82.2552392 unknown
InChI: InChI=1S/C10H12O6/c1-13-7-5(11)9(15-3)10(16-4)6(12)8(7)14-2/h1-4H3
charge 0 multiplicity 1
28 atoms
O  -2.510207 1.311196 -0.24667
O  -2.514671 -1.296876 0.265036
O  2.514578 1.296798 -0.264824
O  2.510236 -1.310928 0.24718
O  0.004664 2.704558 -0.38377
O  -0.004873 -2.704154 0.386712
C  -1.282305 0.680284 -0.15587
C  -1.284274 -0.673956 0.163594
C  1.284127 0.674147 -0.162535
C  1.282214 -0.680124 0.156888
C  0.001657 1.429409 -0.269385
C  -0.00176 -1.429119 0.271104
C  -2.701974 2.515466 -1.088223
C  -2.704477 -2.522548 1.075281
C  2.704006 2.522985 -1.074345
C  2.702385 -2.516164 1.087278
H  -2.307892 3.410629 -0.585573
H  -3.793937 2.574038 -1.215126
H  -2.208108 2.395443 -2.068794
H  -3.794256 -2.569875 1.224205
H  -2.186952 -2.439842 2.047155
H  -2.334439 -3.407661 0.537599
H  3.793709 2.570301 -1.223826
H  2.334334 3.407788 -0.535905
H  2.185927 2.440971 -2.04598
H  2.308573 -3.410869 0.583633
H  2.208536 -2.397482 2.068021
H  3.79438 -2.574516 1.214038
