program: Gaussian 09
title: 000252628
version: EM64L-G09RevD.01
frameworkgroup: C1[X(C8H14O6)]
method: RPBEPBE
basis: SDD
operation: Freq
keyword: #pfreq=noraman
keyword: PBEPBE/SDD
title: #p freq=noraman PBEPBE/SDD
converged: YES YES NO NO
title: Mulliken charges:
elementType: O O O O O O C C C C C C C C H H H H H H H H H H H H H H
charge: -0.443932 -0.465211 -0.255710 -0.295034 -0.222392 -0.233131 0.126115 0.152193 -0.746886 -0.682201 0.264205 0.167349 -0.501990 -0.495214 0.255398 0.209497 0.255408 0.231667 0.209586 0.273977 0.360478 0.369183 0.244655 0.246344 0.232115 0.239739 0.254632 0.249159
chargesum: 0.00000
title: Mulliken charges with hydrogens summed into heavy atoms:
elementType: O O O O O O C C C C C C C C
charge: -0.083454 -0.096028 -0.255710 -0.295034 -0.222392 -0.233131 0.126115 0.152193 -0.026582 0.033029 0.264205 0.167349 0.221123 0.248317
polarizability: 1.30330425e+02 4.54690164e+00 9.24511460e+01 -6.61342173e-01 3.15023950e+00 9.89514809e+01
1716.lowfreq: -9.9475 -4.6569 0.0001 0.0005 0.0006 6.5892 39.9626 51.3369 66.9211
frequency: 39.9300 51.3269 66.8819 78.1591 88.2655 103.6911 119.5637 162.0983 169.7326 183.8504 218.0886 220.9811 240.9197 263.4440 284.7998 297.0172 311.3604 335.4379 340.6717 350.3133 366.9322 416.7687 448.3070 451.5133 508.6205 564.3367 627.4648 715.0001 724.4958 743.0819 803.5748 856.0266 877.8350 893.8513 936.8351 942.4068 1053.6754 1081.1048 1093.2752 1111.0380 1111.8757 1115.1506 1127.4464 1146.1643 1149.3917 1151.6097 1170.9566 1192.4629 1320.0926 1358.2958 1385.0485 1389.5730 1419.2295 1422.6551 1451.1345 1452.3544 1453.3778 1459.3635 1462.0011 1463.0380 1467.7932 1470.7841 1623.5425 1639.9148 2999.1940 3005.9418 3008.1576 3013.7855 3098.4770 3108.3341 3109.5765 3121.7547 3124.2840 3141.5711 3150.5146 3160.2698 3471.6896 3487.4663
redmass: 4.5721 4.0667 3.5706 2.4933 1.3676 1.2041 3.1932 1.4713 3.7709 2.3321 3.0069 1.9856 2.5730 2.1101 2.4972 3.2511 3.4489 3.1779 4.8413 3.7335 1.8688 1.2594 4.5468 3.1586 5.2402 4.4274 4.7069 7.8776 6.0323 5.5119 3.8080 2.7551 3.0787 3.7526 3.9275 3.4404 2.5865 1.8731 2.6800 1.3518 1.5046 1.7605 3.0182 2.4298 1.6107 1.4663 5.4296 3.4903 1.4496 1.7295 1.1858 1.2062 1.1892 1.1843 1.0504 1.0503 1.0604 1.0513 1.0565 1.0513 1.0546 1.0722 9.2661 9.7921 1.0383 1.0293 1.0370 1.0290 1.0968 1.0985 1.1046 1.1053 1.0998 1.0993 1.1051 1.1059 1.0654 1.0652
irintensity: 1.5270 3.7884 0.1768 1.9432 2.1621 0.4192 2.0880 4.3419 5.2878 0.6846 8.3003 4.1204 0.2182 8.1404 35.1496 8.8851 6.4986 9.9881 17.8890 22.9820 42.1231 140.5778 18.3664 22.4477 7.4526 4.4943 19.7134 1.3544 7.3681 26.3263 11.4360 10.6821 18.5205 8.7420 35.6614 4.0806 50.3240 146.1733 71.2288 19.5919 47.7645 75.6853 108.9401 46.3332 13.3468 5.1093 233.7175 91.5224 19.7567 42.3494 12.9570 31.5952 18.0405 11.8735 12.8179 13.8137 6.4366 10.4793 12.1194 12.9504 22.2276 15.7726 157.0657 166.9317 22.1101 33.7578 18.0075 23.7964 20.4193 7.5396 26.1734 18.0018 8.7346 4.8442 14.7625 9.6314 38.4494 32.3245
temp: 298.150 k
press: 1.00000 atm
elementType: 8 8 8 8 8 8 6 6 6 6 6 6 6 6 1 1 1 1 1 1 1 1 1 1 1 1 1 1
symmnumber: 1
zpe: 571497.7 jmol-1
zpe.correction: 0.217672 hartree
zpe.thermalcorrener: 0.234917 hartree
zpe.thermalcorrenthalpy: 0.235861 hartree
zpe.thermalcorrgfe: 0.173060 hartree
zpe.sumelectzpe: -763.451022 hartree
zpe.sumelectthermal: -763.433777 hartree
zpe.sumelectthermalent: -763.432833 hartree
zpe.sumelectthermalfe: -763.495634 hartree
dipole: 3.3447 -0.5097 -2.2493
dipole: 4.0628
quadrupole: -65.4845 -82.9422 -88.4491
quadrupole: 9.1328 -2.5782 0.6630
quadrupole: 13.4741 -3.9836 -9.4905 9.1328 -2.5782 0.6630
hfenergy: -763.668694 hartree
pointgroup: C01 [X(C8H14O6)]
dipole: -1.3057364 0.5763726 0.7196162 debye
polarizability: 129.8223921|-5.2349403|93.2503667|3.6571633|3.3018437|98.6602931 unknown
InChI: InChI=1S/C8H14O6/c1-7(11,5(9)13-3)8(2,12)6(10)14-4/h11-12H,1-4H3
charge 0 multiplicity 1
28 atoms
O  0.388269 1.691309 0.191315
O  0.045124 -2.002311 -0.355468
O  2.534403 0.039668 0.755126
O  -2.309358 0.741257 0.327103
O  2.672521 -0.181185 -1.547912
O  -2.5862 -1.366294 -0.624572
C  0.489537 0.413108 -0.526682
C  -0.354265 -0.717012 0.217944
C  0.037752 0.56064 -1.993877
C  -0.159249 -0.754706 1.749743
C  1.997148 0.050746 -0.523077
C  -1.851985 -0.506307 -0.084144
C  3.986355 -0.259728 0.826491
C  -3.756767 1.015717 0.101888
H  0.672118 1.306036 -2.498096
H  -1.012231 0.902128 -2.047258
H  0.140117 -0.394653 -2.533433
H  -0.303517 0.242851 2.193898
H  -0.870411 -1.470109 2.199578
H  0.866355 -1.086437 1.963503
H  -0.579509 1.918172 0.247003
H  -0.762575 -2.444273 -0.736941
H  4.555798 0.500966 0.266999
H  4.190726 -1.255487 0.398768
H  4.224682 -0.226182 1.898584
H  -3.918938 2.018511 0.519313
H  -4.362877 0.259844 0.626142
H  -3.982026 0.986928 -0.976841
