program: Gaussian 09
title: 000252611
version: EM64L-G09RevD.01
frameworkgroup: C1[X(C16H16N4O6)]
method: RPBEPBE
basis: SDD
operation: Freq
keyword: #p
keyword: freq=noraman
keyword: PBEPBE/SDD
title: #p freq=noraman PBEPBE/SDD
converged: YES YES NO NO
title: Mulliken charges:
elementType: O O O O O O N N N N C C C C C C C C C C C C C C C C H H H H H H H H H H H H H H H H
charge: -0.281535 -0.265065 -0.191341 -0.271746 -0.213980 -0.209086 -0.421706 -0.054335 0.022551 0.015162 0.237764 0.097299 0.184227 0.298442 -0.481571 0.331008 0.258231 -0.347308 -0.364521 -0.291149 -0.786465 -0.498897 0.445905 -0.369805 -0.536226 -0.535782 0.281286 0.240145 0.245095 0.301232 0.381099 0.232414 0.251806 0.281991 0.335181 0.292231 0.221922 0.227909 0.248483 0.219576 0.249040 0.220519
chargesum: 0.00000
title: Mulliken charges with hydrogens summed into heavy atoms:
elementType: O O O O O O N N N N C C C C C C C C C C C C C C C C
charge: -0.281535 -0.265065 -0.191341 -0.271746 -0.213980 -0.209086 -0.040607 -0.054335 0.022551 0.015162 0.237764 0.097299 0.184227 0.298442 -0.200285 0.331008 0.258231 -0.107163 -0.119426 0.010082 -0.020254 -0.163716 0.445905 -0.077574 0.162088 0.153353
polarizability: 5.18932655e+02 1.41031166e+01 2.99712643e+02 -5.70101395e+00 1.09106360e+01 1.19752114e+02
1716.lowfreq: -5.6979 -1.8620 -0.0008 -0.0004 0.0007 2.8774 15.4296 26.8355 35.2195
frequency: 15.3623 26.8024 35.2018 54.2031 64.6344 71.9307 77.4706 90.2643 104.8495 117.7305 132.4750 142.2301 156.9544 165.0268 181.7678 188.1760 205.2172 227.0357 252.3935 260.8937 287.3656 304.0523 320.9877 337.1933 353.9190 363.3394 369.3745 383.7407 404.4847 427.5672 443.9615 472.5090 504.9487 514.6152 519.7581 527.7423 584.5294 600.5208 620.6871 622.4246 650.6747 659.2432 674.4355 693.3609 705.4088 723.9727 726.7997 732.9935 752.9591 796.7591 833.1933 837.9483 862.3259 864.2880 890.6629 897.6405 913.7592 963.0957 974.5476 983.8532 1011.2121 1012.2990 1027.0029 1046.9290 1057.7735 1085.3917 1100.5481 1112.3204 1112.9028 1135.9090 1137.8928 1155.3306 1163.4809 1168.2167 1194.5286 1210.9263 1230.6788 1233.5701 1258.8155 1294.8914 1305.6366 1338.5305 1357.9025 1379.1266 1388.6715 1396.0396 1417.2399 1437.6348 1438.4967 1448.6287 1457.8327 1467.0405 1467.4215 1468.6707 1472.4179 1474.2838 1482.7489 1489.4238 1517.3139 1527.6241 1575.3341 1581.1708 1619.4473 1623.9033 2956.3832 2962.7936 2969.4885 3040.8560 3043.2988 3052.6801 3126.8735 3127.5017 3154.2618 3154.3706 3174.1642 3179.0666 3180.3732 3189.8473 3200.3735 3227.8721
redmass: 6.6371 6.0589 5.9720 7.7474 7.3086 4.0242 6.1513 3.4044 4.7115 3.8974 4.9890 3.0294 3.7753 4.2816 2.8312 3.0229 4.3085 1.0874 1.1985 3.5806 5.6975 6.5352 5.2915 3.5992 6.2316 5.3924 9.3441 4.6972 7.1844 5.9521 4.3645 3.9989 8.8793 3.5115 4.4366 3.7765 4.4539 4.4368 3.8127 6.2712 7.9692 5.9466 9.3122 5.6833 7.8848 4.9710 4.5838 3.6818 12.7180 1.5202 1.1991 5.4004 4.8419 1.4073 5.3065 1.6427 1.3486 1.4056 4.2779 7.0131 3.3397 1.3711 1.6259 2.1994 2.0088 3.5703 4.0060 1.2579 1.2592 1.4400 1.3757 1.3538 2.5892 2.4445 2.3666 4.9886 2.7744 2.5295 1.5700 2.4853 2.6571 4.2270 6.9180 6.0345 4.2853 1.3368 2.4478 1.3868 1.1663 4.6383 1.5783 1.0510 1.0506 1.3299 1.0867 1.0801 1.9250 2.0636 3.3459 5.0847 7.0552 4.5759 7.0680 7.1175 1.0333 1.0328 1.0428 1.0966 1.1039 1.1042 1.0990 1.0997 1.0873 1.0932 1.0953 1.0920 1.0894 1.0919 1.0964 1.0786
irintensity: 0.2418 0.2830 0.2575 0.3053 1.1561 5.8441 2.0488 2.5635 3.7042 6.7985 1.3870 1.9671 0.8621 1.1664 1.7999 3.4758 1.3823 0.0381 0.7195 4.1473 2.0905 3.6973 2.6539 3.9858 0.3505 3.4062 5.3540 2.9090 4.9513 9.0381 1.2561 2.2961 6.6855 14.6671 2.4169 8.7956 8.9040 4.3016 0.9303 5.7037 15.7153 2.4871 18.0996 24.0097 7.1838 1.6024 0.6965 1.7600 9.0271 53.6567 94.0054 4.3540 5.4148 16.6768 7.0442 17.2492 7.0776 24.5202 74.6454 33.1263 58.5615 3.8547 3.3017 9.5382 20.2601 48.7990 58.2798 0.0268 0.1459 73.0535 15.2551 0.4101 157.4204 297.0644 189.0587 672.9896 117.4411 51.5495 28.9783 170.2552 17.6239 329.5521 62.9302 58.1329 3.3924 40.4387 89.8370 14.2037 6.0460 9.8187 53.4895 13.6658 16.2710 142.7245 27.5907 13.6808 91.1953 78.7263 43.9089 91.4943 22.6764 207.0867 259.9889 218.3849 77.8579 99.6366 6.1134 9.1069 49.2630 42.1070 26.7710 11.4154 8.1570 6.7317 15.4561 3.3387 3.7362 21.2634 0.0219 67.9416
temp: 298.150 k
press: 1.00000 atm
elementType: 8 8 8 8 8 8 7 7 7 7 6 6 6 6 6 6 6 6 6 6 6 6 6 6 6 6 1 1 1 1 1 1 1 1 1 1 1 1 1 1 1 1
symmnumber: 1
zpe: 809247.6 jmol-1
zpe.correction: 0.308226 hartree
zpe.thermalcorrener: 0.332675 hartree
zpe.thermalcorrenthalpy: 0.333619 hartree
zpe.thermalcorrgfe: 0.252020 hartree
zpe.sumelectzpe: -1287.555494 hartree
zpe.sumelectthermal: -1287.531045 hartree
zpe.sumelectthermalent: -1287.530101 hartree
zpe.sumelectthermalfe: -1287.611701 hartree
dipole: -13.2067 -0.3914 0.7597
dipole: 13.2343
quadrupole: -158.4747 -152.7018 -150.7840
quadrupole: -5.1915 -6.8232 -8.4686
quadrupole: -4.4879 1.2850 3.2029 -5.1915 -6.8232 -8.4686
hfenergy: -1287.8637201 hartree
pointgroup: C01 [X(C16H16N4O6)]
dipole: -4.9387025 0.5103651 1.5682454 debye
polarizability: 491.272317|-39.1395328|167.6702491|-81.9851739|-71.0509125|279.4548466 unknown
InChI: InChI=1S/C16H16N4O6/c1-10(13-9-12(25-2)5-7-16(13)26-3)17-18-14-6-4-11(19(21)22)8-15(14)20(23)24/h4-9,18H,1-3H3
charge 0 multiplicity 1
42 atoms
O  -3.228761 -0.041873 3.178128
O  -4.593631 0.91071 -2.209743
O  4.774286 -2.303896 0.875206
O  2.613447 -2.267786 1.597201
O  4.864318 1.838663 -3.840313
O  6.30829 0.437344 -2.755457
N  0.872045 -0.724811 0.432329
N  -0.395701 -0.183855 0.255739
N  3.570471 -1.854907 0.790184
N  5.136565 0.954286 -2.934151
C  -2.703017 -0.079655 0.817468
C  -1.34361 -0.617998 1.083152
C  -3.659603 0.174847 1.856268
C  1.90844 -0.319883 -0.376327
C  -3.077368 0.199591 -0.518625
C  -4.360306 0.693141 -0.842018
C  3.242872 -0.858327 -0.225839
C  -4.943548 0.662734 1.529617
C  -5.30366 0.920069 0.187484
C  1.697571 0.657436 -1.405896
C  -1.088167 -1.657546 2.159849
C  4.296963 -0.438334 -1.066502
C  4.038347 0.515182 -2.056983
C  2.737414 1.070145 -2.23236
C  -4.164208 0.268645 4.262666
C  -5.91225 1.417597 -2.594742
H  -2.360859 0.014398 -1.322699
H  -5.677308 0.859365 2.315918
H  -6.308631 1.291726 -0.032062
H  0.689965 1.063913 -1.509384
H  1.123189 -1.427202 1.15777
H  -0.645857 -2.5720 1.714909
H  -0.38217 -1.284044 2.927258
H  -2.015019 -1.932375 2.676109
H  5.297854 -0.857836 -0.937769
H  2.581424 1.814565 -3.01736
H  -5.075232 -0.357933 4.20313
H  -4.44525 1.339278 4.252945
H  -3.615326 0.037806 5.187256
H  -6.715794 0.71035 -2.309245
H  -5.875001 1.511798 -3.689709
H  -6.111483 2.409074 -2.142503
