program: Gaussian 09
title: 000252608
version: EM64L-G09RevD.01
frameworkgroup: C1[X(C16H11NO3)]
method: RPBEPBE
basis: SDD
operation: Freq
keyword: #p
keyword: freq=noraman
keyword: PBEPBE/SDD
title: #p freq=noraman PBEPBE/SDD
converged: YES YES NO NO
title: Mulliken charges:
elementType: O O O N C C C C C C C C C C C C C C C C H H H H H H H H H H H
charge: -0.231529 -0.241290 -0.273710 -0.467492 0.394905 0.172791 0.248355 -0.362397 -0.393601 0.061620 -0.340926 0.255929 0.138744 -0.248446 -0.212927 -0.334385 -0.339013 -0.225266 -0.242773 -0.224284 0.325666 0.246646 0.355032 0.266252 0.235541 0.238101 0.275115 0.218859 0.234679 0.234389 0.235415
chargesum: 0.00000
title: Mulliken charges with hydrogens summed into heavy atoms:
elementType: O O O N C C C C C C C C C C C C C C C C
charge: -0.231529 -0.241290 -0.273710 -0.112460 0.394905 0.172791 0.248355 -0.036731 -0.146955 0.061620 -0.074674 0.255929 0.138744 -0.012905 0.025175 -0.059269 -0.120153 0.009413 -0.008384 0.011131
polarizability: 3.77001268e+02 -2.43954695e+01 1.93940541e+02 3.69987000e+00 3.77868341e+00 7.28852895e+01
1716.lowfreq: -3.5893 -0.0007 -0.0005 0.0005 3.3734 5.6274 22.7782 32.4304 62.8584
frequency: 22.7190 32.3979 62.8446 75.7865 114.7750 128.5637 154.9497 189.0900 230.7571 257.1036 302.6623 324.5588 330.1894 398.3903 416.5244 434.7186 435.8629 453.9499 472.0565 503.9766 552.8969 560.3504 597.4345 613.7896 653.3379 685.7745 695.5184 699.7335 720.9052 727.4336 746.3830 754.4235 766.4000 795.7447 829.8723 854.1708 867.9479 889.4922 913.7721 937.9377 939.4564 960.6219 987.3227 988.6631 989.2136 1009.0721 1010.3245 1024.5627 1035.4471 1088.5096 1109.8917 1120.0022 1161.6155 1174.6702 1176.2241 1196.5182 1200.0469 1253.6544 1261.6751 1290.6816 1324.3570 1358.7245 1386.2887 1402.0455 1434.4924 1445.3964 1473.6594 1481.6604 1514.3415 1563.0811 1569.9030 1600.4692 1609.5837 1610.0482 1622.4612 1641.5657 3122.2269 3134.6831 3137.1894 3147.9756 3149.0977 3160.6101 3166.0052 3171.6674 3179.8556 3183.1029 3467.4272
redmass: 4.4052 5.4151 5.8252 6.0662 7.6516 6.4038 6.1078 5.6026 6.5409 5.8745 6.4122 8.9290 4.3502 2.8016 4.9170 8.0711 5.6630 3.9640 3.9097 6.9760 3.6408 7.2921 8.4506 6.4386 6.9344 4.8763 1.9414 3.2962 6.7333 5.3910 2.5530 1.5704 1.2511 2.4920 6.4135 1.2531 1.3964 7.3340 4.5292 1.4109 1.3806 1.4068 1.5145 1.3291 4.4107 1.3530 5.4832 2.0964 2.4704 1.5987 1.8840 3.6437 1.9965 1.0624 1.2748 1.4134 1.3949 2.0711 2.1105 2.4041 1.3492 2.6628 8.6802 8.1475 2.2597 2.6311 2.5844 2.4779 2.3275 6.0710 6.7922 7.2915 6.4565 5.9614 5.9161 9.8506 1.0876 1.0871 1.0870 1.0919 1.0904 1.0957 1.0954 1.1009 1.0994 1.0934 1.0758
irintensity: 0.8749 0.8906 2.4810 2.4012 0.4692 8.1547 2.7442 0.7587 5.0832 0.0557 12.9729 0.0453 0.5300 0.0779 0.3301 1.9553 0.6275 10.1737 5.7398 14.7373 0.0320 10.7539 22.1190 0.7690 11.6391 5.3311 32.4758 20.8131 1.6262 11.6517 86.1880 65.1510 77.1679 14.7314 17.5455 0.9047 2.9282 5.0107 5.6080 0.6758 16.0415 27.0117 1.8077 0.1961 1.1577 1.5628 1.9945 2.7257 29.5104 26.4734 13.4170 45.2801 1.0445 2.7677 9.0408 4.3470 10.1948 153.0618 8.1930 42.5881 3.4915 259.9876 1.7432 19.4378 3.8189 36.3317 178.7504 7.2309 753.3225 130.8427 38.6665 189.6934 24.4664 26.1547 29.5884 167.2162 11.2539 1.5668 1.2082 18.5415 6.9972 13.7542 17.1309 26.5460 15.0497 2.9246 45.9724
temp: 298.150 k
press: 1.00000 atm
elementType: 8 8 8 7 6 6 6 6 6 6 6 6 6 6 6 6 6 6 6 6 1 1 1 1 1 1 1 1 1 1 1
symmnumber: 1
zpe: 605557.4 jmol-1
zpe.correction: 0.230645 hartree
zpe.thermalcorrener: 0.246204 hartree
zpe.thermalcorrenthalpy: 0.247149 hartree
zpe.thermalcorrgfe: 0.186069 hartree
zpe.sumelectzpe: -895.389258 hartree
zpe.sumelectthermal: -895.373698 hartree
zpe.sumelectthermalent: -895.372754 hartree
zpe.sumelectthermalfe: -895.433834 hartree
dipole: -0.0415 -1.4154 0.1850
dipole: 1.4280
quadrupole: -75.7791 -120.1811 -119.8900
quadrupole: -9.4231 0.7906 2.3658
quadrupole: 29.5043 -14.8977 -14.6066 -9.4231 0.7906 2.3658
hfenergy: -895.6199028 hartree
pointgroup: C01[X(C16H11N1O3)]
dipole: -0.0237405 0.5613117 -0.0050855 debye
polarizability: 376.3006549|27.1964176|191.964446|-2.5470205|17.9854958|75.561998 unknown
InChI: InChI=1S/C16H11NO3/c18-15(11-6-2-1-3-7-11)17-13-10-12-8-4-5-9-14(12)20-16(13)19/h1-10,17H
charge 0 multiplicity 1
31 atoms
O  2.586553 -1.702085 -0.197784
O  0.516579 -2.70778 -0.225891
O  -1.357002 1.894964 0.144713
N  -0.842908 -0.373301 -0.051148
C  2.777252 0.747512 -0.03489
C  3.382099 -0.53914 -0.135201
C  0.560165 -0.296962 -0.065911
C  1.335695 0.849455 0.001498
C  3.640373 1.88067 0.025562
C  1.174458 -1.640399 -0.16712
C  4.777036 -0.718288 -0.17604
C  -3.203032 0.321511 -0.032954
C  -1.745729 0.689967 0.024676
C  5.035526 1.720278 -0.014226
C  5.604606 0.42108 -0.115095
C  -4.133761 1.326613 0.338616
C  -3.684857 -0.947918 -0.453065
C  -5.518208 1.065835 0.309057
C  -5.072034 -1.206308 -0.484956
C  -5.991972 -0.203456 -0.099839
H  0.84555 1.822082 0.082565
H  3.195583 2.879081 0.103264
H  -1.191378 -1.338954 -0.083343
H  5.186237 -1.729522 -0.253536
H  5.6886 2.59752 0.032523
H  6.692428 0.301144 -0.145681
H  -3.742431 2.303159 0.641596
H  -3.002488 -1.738336 -0.788565
H  -6.226991 1.847667 0.602254
H  -5.434214 -2.185367 -0.816218
H  -7.067934 -0.408123 -0.124758
