program: Gaussian 09
title: 000252606
version: EM64L-G09RevD.01
frameworkgroup: C1[X(C20H17NO)]
method: RPBEPBE
basis: SDD
operation: Freq
keyword: #p
keyword: freq=noraman
keyword: PBEPBE/SDD
title: #p freq=noraman PBEPBE/SDD
converged: NO YES NO NO
title: Mulliken charges:
elementType: O N C C C C C C C C C C C C C C C C C C C C H H H H H H H H H H H H H H H H H
charge: -0.269524 -0.449131 -0.567998 0.500637 0.500642 0.213141 -0.427925 -0.350431 -0.351142 -0.428189 0.482296 -0.226223 -0.236576 -0.236512 -0.226168 -0.244195 -0.244248 -0.451890 -0.343381 -0.197369 -0.215366 -0.253342 0.183446 0.217580 0.267398 0.267671 0.217420 0.303774 0.224190 0.225245 0.225302 0.224162 0.228207 0.228186 0.218705 0.307401 0.227086 0.227403 0.229718
chargesum: 0.00000
title: Mulliken charges with hydrogens summed into heavy atoms:
elementType: O N C C C C C C C C C C C C C C C C C C C C
charge: -0.269524 -0.145357 -0.384552 0.500637 0.500642 0.213141 -0.210344 -0.083034 -0.083470 -0.210769 0.482296 -0.002033 -0.011331 -0.011209 -0.002005 -0.015989 -0.016062 -0.233185 -0.035980 0.029718 0.012036 -0.023624
polarizability: 2.63740749e+02 -5.05482442e-01 1.94636217e+02 -1.68242361e-01 7.86501137e-02 2.12971053e+02
1716.lowfreq: -29.5961 -10.9831 -8.8698 -5.5533 -0.0009 -0.0007 -0.0004 13.7012 30.0119
frequency: -29.3823 13.5542 29.9321 37.8559 55.3720 78.2794 88.7116 128.9726 180.8441 199.4293 209.1109 251.2126 258.1421 281.1650 336.9601 348.6038 399.3267 404.9481 407.6997 471.4526 472.7867 506.6691 551.5085 558.7026 612.8745 614.8255 615.9556 640.9252 644.9809 694.4384 696.5212 702.7482 706.6149 741.8494 754.2921 769.8652 792.9561 801.7276 843.2685 846.4061 853.5959 856.7074 864.5115 915.6909 919.1345 919.8831 955.1512 971.9519 973.6701 976.9936 985.1764 989.2162 991.7290 993.8707 996.9713 1001.5297 1026.3784 1028.3068 1029.2859 1077.2306 1089.3533 1090.4082 1150.8716 1171.3178 1171.4413 1172.9869 1179.1612 1186.1302 1189.5212 1190.1829 1194.4673 1228.5876 1257.8073 1293.6700 1321.5882 1333.2790 1348.5667 1382.9065 1383.8377 1387.9783 1426.6358 1439.8472 1442.8181 1476.9811 1480.8983 1485.2383 1509.9349 1591.8103 1593.1622 1599.5071 1606.7457 1610.3789 1613.5521 1618.7915 2988.3778 3109.2891 3109.5918 3111.3575 3126.5714 3127.1493 3133.2491 3139.6753 3140.4719 3145.6392 3155.4125 3158.0940 3166.4119 3166.6380 3170.6885 3198.4957 3530.6361
redmass: 3.7387 6.0147 4.1154 3.9213 4.7114 4.9538 5.2488 7.0254 4.8791 4.7820 6.0789 4.6132 4.2179 4.4730 9.7268 5.6118 2.8014 2.8690 2.9220 4.7325 3.4508 3.0547 5.2033 4.5530 6.4101 6.4583 6.4160 5.5089 1.1831 2.7143 2.1700 2.6233 1.7294 3.0499 1.8718 1.7164 3.0345 5.5626 1.2709 1.2611 1.2519 3.9440 4.3343 1.4545 1.4326 1.8331 3.4725 1.4013 1.3526 1.4034 6.0857 5.5398 5.3544 1.3400 1.3479 1.3063 2.2225 2.1856 2.2491 1.6271 1.5640 1.5979 2.3186 1.0844 1.2135 1.0524 2.2108 1.5205 1.1173 1.3748 1.1147 1.6565 2.1920 1.5362 1.4509 1.2577 1.4033 6.9528 6.9464 5.9980 2.3462 2.1317 2.1838 2.2114 2.2401 2.3516 2.0809 5.9859 6.4376 6.9004 6.0994 4.7848 5.3444 5.2499 1.0837 1.0878 1.0886 1.0876 1.0863 1.0867 1.0867 1.0923 1.0928 1.0934 1.0959 1.0971 1.0999 1.1000 1.0977 1.0951 1.0761
irintensity: 0.2859 1.0449 0.0127 0.0099 0.2616 0.1488 2.4428 4.4847 6.2885 6.2193 0.3712 0.5104 0.2937 0.2681 9.2274 0.0002 0.0251 0.2172 0.0095 0.0300 4.4254 28.2149 1.3326 47.9292 1.2358 0.3456 0.0284 8.4623 31.4676 1.0453 52.8004 30.6434 78.9452 40.9243 24.2611 100.0626 3.3571 9.6404 0.2183 0.0161 1.2730 2.4710 1.8974 0.4296 13.8221 0.3248 14.5360 0.0052 0.1466 1.9444 0.0431 0.3168 0.0481 0.0054 2.1408 2.7490 9.7154 15.4936 5.8175 1.1811 7.7818 32.6425 107.7373 0.0377 0.3927 1.0403 1.9153 0.0213 0.7438 2.4941 3.8131 3.9956 28.7270 22.1630 52.0158 4.1371 21.3960 0.2387 50.7508 42.3809 124.5797 0.5223 18.3492 42.0888 81.0983 46.5305 347.8699 0.2823 18.1961 70.2326 17.5856 10.7043 57.3603 25.3535 27.0455 9.3590 14.5782 12.1175 0.5233 0.9273 0.3257 2.9693 57.3089 29.4880 27.8094 20.3101 27.7681 21.2199 12.1642 7.3815 11.1798
temp: 298.150 k
press: 1.00000 atm
elementType: 8 7 6 6 6 6 6 6 6 6 6 6 6 6 6 6 6 6 6 6 6 6 1 1 1 1 1 1 1 1 1 1 1 1 1 1 1 1 1
symmnumber: 1
zpe: 819301.9 jmol-1
zpe.correction: 0.312056 hartree
zpe.thermalcorrener: 0.329402 hartree
zpe.thermalcorrenthalpy: 0.330347 hartree
zpe.thermalcorrgfe: 0.264165 hartree
zpe.sumelectzpe: -900.801336 hartree
zpe.sumelectthermal: -900.783990 hartree
zpe.sumelectthermalent: -900.783046 hartree
zpe.sumelectthermalfe: -900.849227 hartree
dipole: -0.3356 0.0256 -3.0229
dipole: 3.0415
quadrupole: -119.6787 -126.9031 -113.4058
quadrupole: -0.0753 2.2107 0.0977
quadrupole: 0.3172 -6.9072 6.5901 -0.0753 2.2107 0.0977
hfenergy: -901.1133921 hartree
pointgroup: C01 [X(C20H17N1O1)]
dipole: 0.1507273 0.0046531 1.1870969 debye
polarizability: 263.0795946|-6.6647534|195.2814857|-0.9020899|0.1671313|212.986939 unknown
InChI: InChI=1S/C20H17NO/c22-20(21-18-14-8-3-9-15-18)19(16-10-4-1-5-11-16)17-12-6-2-7-13-17/h1-15,19,21H
charge 0 multiplicity 1
39 atoms
O  0.61578 -0.058338 -1.492273
N  1.662859 -0.147013 0.603416
C  -0.786509 0.123407 0.537635
C  -1.442074 1.486775 0.241371
C  -1.737885 -1.057903 0.263562
C  0.54991 -0.037052 -0.225363
C  -1.913707 2.269809 1.32498
C  -2.025809 -1.507562 -1.05004
C  -1.616446 1.97009 -1.080332
C  -2.370647 -1.695802 1.360138
C  3.036482 -0.294079 0.247697
C  -2.554784 3.508388 1.098328
C  -2.930075 -2.572627 -1.255269
C  -2.252167 3.210597 -1.30632
C  -3.279391 -2.758004 1.154297
C  -2.727378 3.983185 -0.221414
C  -3.563644 -3.199766 -0.157568
C  3.974777 -0.383236 1.31172
C  3.490177 -0.351354 -1.09734
C  5.349281 -0.527126 1.038945
C  4.871127 -0.495734 -1.352622
C  5.807641 -0.584387 -0.298077
H  -0.573115 0.107693 1.624591
H  -1.785908 1.906995 2.353073
H  -1.520805 -1.040199 -1.9007
H  -1.231404 1.385951 -1.921626
H  -2.157796 -1.356767 2.382277
H  1.477905 -0.115734 1.608595
H  -2.915667 4.099348 1.947672
H  -3.139692 -2.913961 -2.275354
H  -2.376044 3.574823 -2.332468
H  -3.76103 -3.238232 2.013517
H  -3.223075 4.943586 -0.401745
H  -4.267111 -4.023566 -0.32214
H  3.6271 -0.339584 2.352517
H  2.766222 -0.282643 -1.910422
H  6.060425 -0.594296 1.869463
H  5.214834 -0.538773 -2.392214
H  6.875747 -0.696211 -0.511811
