program: Gaussian 09
title: 000260869
version: EM64L-G09RevD.01
frameworkgroup: C1[X(C19H14Cl2N4O2S)]
method: RPBEPBE
basis: SDD
operation: Freq
keyword: #p
keyword: freq=noraman
keyword: PBEPBE/SDD
title: #p freq=noraman PBEPBE/SDD
converged: YES YES NO NO
title: Mulliken charges:
elementType: Cl Cl S O O N N N N C C C C C C C C C C C C C C C C C C C H H H H H H H H H H H H H H
charge: -0.029296 -0.032839 0.246101 -0.312705 -0.252091 -0.132735 0.007774 -0.325656 -0.339790 0.158855 -0.627273 -0.180234 -0.047082 0.495947 0.183680 0.162876 -0.733890 -0.377701 -0.388257 0.649270 -0.231669 -0.229106 -0.232229 -0.293280 -0.290902 -0.233179 -0.234421 -0.209349 0.278941 0.245039 0.319716 0.324664 0.338463 0.338050 0.236513 0.289022 0.227836 0.227832 0.229932 0.264352 0.264256 0.244566
chargesum: 0.00000
title: Mulliken charges with hydrogens summed into heavy atoms:
elementType: Cl Cl S O O N N N N C C C C C C C C C C C C C C C C C C C
charge: -0.029296 -0.032839 0.246101 -0.312705 -0.252091 -0.132735 0.007774 0.012807 -0.001740 0.158855 -0.103294 -0.180234 -0.047082 0.495947 0.183680 0.162876 -0.089509 -0.141188 -0.099235 0.649270 -0.003833 -0.001273 -0.002298 -0.293280 -0.290902 0.031173 0.029836 0.035218
polarizability: 3.72898180e+02 2.57155185e+01 2.71863205e+02 -5.87968434e+00 1.08059425e+01 2.03981853e+02
1716.lowfreq: -5.8942 -4.6406 -0.0018 0.0008 0.0012 2.3197 9.9206 10.2382 14.7598
frequency: 9.5036 9.5213 14.6504 33.9929 35.6137 46.1779 59.2761 72.3115 86.0702 100.8916 112.1285 125.4566 170.1605 175.7414 178.2071 193.8852 207.6355 217.5270 255.5205 279.0709 298.5291 306.6204 320.8774 349.3807 357.5284 367.2421 381.9197 403.2831 410.0056 423.2713 463.2317 467.9362 486.0373 502.0305 518.3423 524.6118 538.5750 567.6049 593.7954 599.4600 617.1423 627.0152 643.1114 652.3155 670.8230 698.0191 704.7991 720.9558 721.7244 751.2570 751.7237 776.3851 781.2540 797.0064 819.3554 820.4877 861.1352 892.4674 896.1245 939.3403 953.9863 971.6004 986.9036 990.0861 1002.1802 1006.2105 1028.4133 1050.1381 1052.9226 1069.2439 1089.4647 1112.7744 1117.6147 1162.4776 1174.1648 1186.7428 1193.4631 1209.3519 1218.7540 1221.2459 1230.1402 1260.4126 1288.6507 1312.2167 1334.2945 1341.8436 1359.4250 1364.5415 1366.5222 1379.7626 1389.5157 1419.5398 1428.5823 1431.4841 1438.1598 1445.1128 1463.5580 1470.6213 1480.2074 1488.2591 1561.2155 1593.2070 1594.4628 1613.1476 1615.8813 1661.4435 3021.0361 3076.7285 3095.2835 3122.8016 3127.6496 3138.0345 3148.6177 3153.8855 3158.5730 3164.1388 3176.6894 3186.7908 3544.8786 3554.8865
redmass: 10.4420 10.5884 4.9660 5.7335 7.8067 8.7411 7.9638 9.4404 7.6091 10.4159 7.9856 10.9829 6.4136 5.7426 5.4248 4.5786 8.0973 14.3932 6.4014 7.7558 3.4597 3.9918 10.6681 2.1331 1.9225 9.1200 5.7371 2.8914 4.3305 10.2807 4.7026 3.9649 9.5507 4.8358 6.0597 5.4477 1.2090 5.9378 6.9008 7.2912 6.2990 5.0910 6.0609 6.4804 7.5426 10.5673 2.5367 2.6757 4.4010 3.6303 6.2641 3.5586 1.7314 5.5551 3.4556 4.9684 1.2507 1.5767 1.3598 1.4641 2.0578 1.3321 1.4134 5.4868 4.0375 1.4786 2.2727 4.4347 3.8562 2.7586 1.6211 5.4448 1.3099 1.1482 1.0601 1.9064 1.1670 2.6980 1.4105 2.3103 5.3607 1.2931 5.9916 2.8371 1.9099 1.9214 1.8857 2.7846 8.0835 2.9933 2.7245 2.2058 2.3465 1.9057 1.5961 2.1018 1.3689 6.8365 2.5385 2.1074 6.6545 8.1415 6.0431 5.8536 5.5420 7.5178 1.0623 1.0579 1.1023 1.0853 1.0883 1.0926 1.0965 1.0878 1.1086 1.1016 1.0930 1.0994 1.0797 1.0796
irintensity: 0.1189 0.6378 0.0206 0.8233 0.0428 0.6732 0.8878 0.6476 0.4956 0.7137 11.0881 0.1389 0.3723 0.2573 3.1997 0.0076 0.4554 4.8095 2.3596 4.4816 1.3950 0.8097 8.0025 1.5874 5.7272 2.0906 6.1104 0.2894 4.8385 27.4965 0.6005 1.7248 5.3840 4.0120 11.9157 0.0022 217.8736 12.6917 7.4072 8.7033 0.3175 14.8693 18.5415 8.2139 26.6754 13.4715 23.7292 63.6533 86.2759 27.0626 5.2496 3.2793 52.4590 3.4333 5.9143 3.7862 0.9687 28.6796 0.1856 7.1287 12.5678 0.7420 0.4157 0.3165 0.5830 2.1787 8.6922 2.9041 166.4364 9.1100 13.0098 19.3013 19.5874 0.0153 0.2097 21.6748 5.6862 11.2195 3.5986 1.1951 57.6920 46.7091 77.3608 26.1118 138.2568 113.5009 15.3353 32.8152 1.1921 21.2917 36.7347 64.9341 5.2831 5.1429 38.1037 2.1072 22.1538 87.2739 12.8734 32.3542 48.6597 25.0123 14.1283 258.9332 401.6080 133.3707 16.1157 0.9348 0.7446 2.6428 7.0855 9.2327 25.7670 4.3027 0.6700 31.2519 0.6534 6.4697 14.7460 172.8930
temp: 298.150 k
press: 1.00000 atm
elementType: 17 17 16 8 8 7 7 7 7 6 6 6 6 6 6 6 6 6 6 6 6 6 6 6 6 6 6 6 1 1 1 1 1 1 1 1 1 1 1 1 1 1
symmnumber: 1
zpe: 778804.9 jmol-1
zpe.correction: 0.296631 hartree
zpe.thermalcorrener: 0.321921 hartree
zpe.thermalcorrenthalpy: 0.322865 hartree
zpe.thermalcorrgfe: 0.235703 hartree
zpe.sumelectzpe: -2418.090455 hartree
zpe.sumelectthermal: -2418.065165 hartree
zpe.sumelectthermalent: -2418.064221 hartree
zpe.sumelectthermalfe: -2418.151383 hartree
dipole: 0.6767 2.0320 -1.4524
dipole: 2.5878
quadrupole: -132.1175 -181.5597 -191.9982
quadrupole: 20.0194 -10.6931 10.2554
quadrupole: 36.4410 -13.0012 -23.4398 20.0194 -10.6931 10.2554
hfenergy: -2418.387086 hartree
pointgroup: C01 [X(C19H14Cl2N4O2S1)]
dipole: 0.3712927 -0.7642474 0.5609088 debye
polarizability: 377.7459438|-12.434651|266.9609324|1.7564235|12.044079|204.0363619 unknown
InChI: InChI=1S/C19H14Cl2N4O2S/c20-13-7-4-8-14(21)12(13)10-28-19-22-15-16(18(27)24-23-17(15)26)25(19)9-11-5-2-1-3-6-11/h1-8,23-24H,9-10H2
charge 0 multiplicity 1
42 atoms
Cl 3.769253 -0.716723 -2.624515
Cl 3.721428 2.362101 2.067836
S  1.338875 -0.229108 0.408691
O  -4.500245 0.021346 1.327274
O  -2.196196 3.788497 -2.057585
N  -1.446864 0.024708 0.673691
N  -0.480406 1.593201 -0.69081
N  -4.583085 1.85668 -0.100325
N  -3.986151 2.820978 -0.945566
C  -2.471131 0.86077 0.218003
C  -1.584635 -1.164344 1.566942
C  -0.27005 0.509841 0.092765
C  -1.851751 1.818099 -0.614257
C  -1.802941 -2.472195 0.810538
C  -3.889547 0.831094 0.550476
C  -2.612363 2.886196 -1.277717
C  2.393586 1.115026 -0.482042
C  -0.708243 -3.308026 0.475097
C  -3.116117 -2.865825 0.444731
C  3.84828 0.81025 -0.268953
C  -0.919282 -4.514598 -0.22958
C  -3.325492 -4.072324 -0.259045
C  -2.22864 -4.898099 -0.60053
C  4.597719 0.00447 -1.169479
C  4.577612 1.322013 0.839312
C  5.967258 -0.272806 -1.001533
C  5.946505 1.070753 1.046508
C  6.64057 0.267348 0.115656
H  -2.441744 -0.954772 2.226733
H  -0.662935 -1.207161 2.175228
H  2.089474 2.07473 -0.04312
H  2.097532 1.076298 -1.538596
H  -5.582028 1.959661 0.092727
H  -4.613355 3.500594 -1.381948
H  0.309233 -3.016802 0.762369
H  -3.961522 -2.224547 0.720479
H  -0.066536 -5.153059 -0.48571
H  -4.342728 -4.371119 -0.536064
H  -2.393091 -5.834399 -1.145747
H  6.493226 -0.896287 -1.728962
H  6.456256 1.494468 1.915493
H  7.705772 0.062572 0.260834
