program: Gaussian 09
title: 000252604
version: EM64L-G09RevD.01
frameworkgroup: C1[X(C20H16N2O2)]
method: RPBEPBE
basis: SDD
operation: Freq
keyword: #p
keyword: freq=noraman
keyword: PBEPBE/SDD
title: #p freq=noraman PBEPBE/SDD
converged: YES YES NO YES
title: Mulliken charges:
elementType: O O N N C C C C C C C C C C C C C C C C C C C C H H H H H H H H H H H H H H H H
charge: -0.258608 -0.258599 -0.484227 -0.484221 0.557847 0.557808 -0.717067 -0.386773 -0.386743 -0.189382 0.248561 0.248634 0.132427 0.132396 -0.343143 -0.359696 -0.343079 -0.359788 -0.222072 -0.236244 -0.222099 -0.236218 -0.226146 -0.226144 0.208818 0.310975 0.311008 0.309300 0.309292 0.228040 0.275195 0.217403 0.275171 0.217453 0.234636 0.230814 0.234636 0.230816 0.234510 0.234511
chargesum: 0.00000
title: Mulliken charges with hydrogens summed into heavy atoms:
elementType: O O N N C C C C C C C C C C C C C C C C C C C C
charge: -0.258608 -0.258599 -0.174927 -0.174929 0.557847 0.557808 -0.508248 -0.075798 -0.075735 0.038658 0.248561 0.248634 0.132427 0.132396 -0.067948 -0.142293 -0.067908 -0.142336 0.012565 -0.005430 0.012537 -0.005402 0.008364 0.008367
polarizability: 4.20296918e+02 6.88196848e-04 2.58891072e+02 2.17280848e+01 -1.18884024e-03 1.08704292e+02
1716.lowfreq: -5.2313 -0.0006 -0.0005 0.0004 2.2642 5.6780 20.7142 22.7868 34.7530
frequency: 20.7140 22.7765 34.7528 46.0920 50.8874 60.1436 92.6910 93.5603 153.9306 165.7821 180.5357 192.9221 232.7084 268.5434 271.8802 291.8046 314.0713 393.6579 402.3583 402.9888 411.5615 423.4821 458.7922 477.2488 483.6118 561.4401 591.5912 600.5943 613.5161 614.3397 636.6927 654.6868 663.2459 684.2842 688.4096 688.5331 695.6417 703.6714 703.7995 767.1710 789.6251 793.2032 817.8610 852.2784 853.3769 859.7733 865.9183 870.2995 927.2733 934.0901 938.1831 938.3747 981.5109 982.9192 982.9784 989.4258 989.5013 1004.2359 1005.9738 1005.9901 1024.3822 1026.9162 1081.3648 1083.4897 1096.0375 1097.2095 1103.3790 1174.4370 1174.4880 1182.2801 1191.2526 1192.0059 1212.2197 1243.3660 1249.9345 1300.8846 1313.6327 1318.6605 1322.8229 1384.2107 1384.5006 1385.8233 1387.8315 1433.1909 1434.5758 1471.9971 1478.9720 1481.1177 1517.2786 1530.3835 1576.8265 1578.1305 1603.5942 1608.9520 1609.5402 1610.6178 1612.2554 1623.8336 3087.6900 3113.4772 3113.5240 3132.9959 3133.0034 3144.8375 3145.9000 3145.9153 3159.2940 3159.3091 3170.8791 3170.9263 3202.6944 3206.2779 3531.9803 3532.1550
redmass: 4.4484 4.2304 6.0406 5.4738 4.3223 7.1269 5.8906 6.0567 5.3891 4.9539 6.7679 5.1004 5.0862 4.3430 4.9750 5.9234 8.3249 6.2059 2.8397 2.8723 5.0935 4.2889 3.2875 4.7150 4.6324 6.1173 2.4962 4.8249 5.9604 6.3063 1.2129 2.4194 3.4314 5.0533 4.5732 6.1065 1.9943 1.5358 1.5335 5.6799 2.3611 2.5094 1.2522 1.6626 1.3005 3.0133 2.0747 4.6361 2.5168 1.4419 1.3670 1.9744 5.9197 1.4479 1.4629 5.0379 5.0184 1.3122 1.3461 1.3458 2.4900 2.2505 1.8409 1.6325 1.5830 2.6227 2.3595 1.0580 1.0574 1.1146 1.1158 1.1157 1.7772 2.3471 3.2638 2.3308 1.4690 1.3440 1.5181 8.7936 8.5710 2.7293 8.2944 2.2338 2.2431 2.3255 2.2521 2.5155 2.0794 2.5573 6.5275 5.2250 6.4939 5.8349 5.9009 6.4477 3.9837 5.7813 1.0909 1.0878 1.0878 1.0868 1.0868 1.0902 1.0919 1.0919 1.0957 1.0957 1.1005 1.1005 1.0930 1.0966 1.0758 1.0758
irintensity: 0.0003 0.6043 0.0615 0.0004 0.0092 8.8433 2.7317 0.0610 1.6786 2.9193 0.1104 0.3539 19.2222 0.0338 3.2191 13.7685 1.1024 3.0864 0.1115 0.0711 2.9831 1.2793 6.7205 1.3714 11.1540 38.1314 0.9512 2.0180 3.3866 0.2843 75.6252 0.4952 2.4125 27.3477 0.1857 6.4865 27.0181 200.2654 19.3878 0.3112 35.7636 9.3943 26.3871 0.0225 2.5675 2.3422 92.2352 31.7192 16.0759 0.4535 0.3775 3.8867 0.0025 4.1887 0.8955 0.0788 1.7378 6.2952 2.9048 1.5765 5.8457 12.5812 2.6728 45.1818 20.0003 5.5897 2.8907 2.9168 0.2961 6.7203 24.5227 2.2073 6.7460 200.0073 53.9663 7.2252 202.1904 19.5647 3.9878 7.0879 0.4461 1.2986 291.3938 5.0509 2.5959 596.7360 11.4493 327.3403 222.4662 64.7741 101.7333 19.0574 57.0221 92.0429 8.5130 8.0908 76.4191 169.7228 14.7048 27.2344 4.1906 0.9024 0.8786 17.1303 36.4863 6.3602 6.2605 25.1473 35.9395 10.7034 19.3517 0.2579 1.3721 13.7630
temp: 298.150 k
press: 1.00000 atm
elementType: 8 8 7 7 6 6 6 6 6 6 6 6 6 6 6 6 6 6 6 6 6 6 6 6 1 1 1 1 1 1 1 1 1 1 1 1 1 1 1 1
symmnumber: 1
zpe: 816159.2 jmol-1
zpe.correction: 0.310859 hartree
zpe.thermalcorrener: 0.330763 hartree
zpe.thermalcorrenthalpy: 0.331707 hartree
zpe.thermalcorrgfe: 0.259123 hartree
zpe.sumelectzpe: -1030.067827 hartree
zpe.sumelectthermal: -1030.047923 hartree
zpe.sumelectthermalent: -1030.046979 hartree
zpe.sumelectthermalfe: -1030.119563 hartree
dipole: -0.0010 -7.3780 -0.0003
dipole: 7.3780
quadrupole: -121.5081 -132.5921 -144.4392
quadrupole: -0.0024 3.2597 -0.0005
quadrupole: 11.3384 0.2543 -11.5927 -0.0024 3.2597 -0.0005
hfenergy: -1030.3786857 hartree
pointgroup: C01 [X(C20H16N2O2)]
dipole: -0.0013728 -2.9027128 0.0052183 debye
polarizability: 419.8449863|-0.0542546|258.8906191|24.7530176|-0.2774224|109.1566765 unknown
InChI: InChI=1S/C20H16N2O2/c23-19(15-8-3-1-4-9-15)21-17-12-7-13-18(14-17)22-20(24)16-10-5-2-6-11-16/h1-14,21-22H
charge 0 multiplicity 1
40 atoms
O  -4.090359 1.94181 -0.213894
O  4.090089 1.937481 0.206477
N  -2.421762 0.295989 -0.029042
N  2.419719 0.292861 0.02776
C  -1.23325 1.080236 -0.020768
C  1.232242 1.078606 0.016323
C  -0.000985 0.379825 -0.000843
C  -1.236478 2.501024 -0.027438
C  1.23745 2.499392 0.01739
C  0.000959 3.17711 -0.006352
C  -4.778747 -0.377619 -0.016344
C  4.776053 -0.383402 0.017402
C  -3.75072 0.725165 -0.088167
C  3.749166 0.720698 0.085722
C  -6.05686 -0.109059 -0.569927
C  -4.542628 -1.634326 0.602928
C  6.054464 -0.114388 0.57007
C  4.538666 -1.641809 -0.597935
C  -7.071229 -1.087463 -0.533646
C  -5.561146 -2.611785 0.643724
C  7.067837 -1.093935 0.536869
C  5.556186 -2.620431 -0.635656
C  -6.824998 -2.344312 0.068613
C  6.820315 -2.352428 -0.061411
H  -0.001748 -0.720132 0.001341
H  -2.184919 3.038123 -0.054118
H  2.186641 3.035277 0.041997
H  -2.278536 -0.716006 -0.035267
H  2.275242 -0.718921 0.037655
H  0.001726 4.272671 -0.008501
H  -6.230034 0.876278 -1.014551
H  -3.588087 -1.847014 1.101127
H  6.228649 0.872171 1.011576
H  3.583931 -1.855064 -1.095514
H  -8.052391 -0.871803 -0.970196
H  -5.374305 -3.57327 1.134336
H  8.049225 -0.8779 0.972723
H  5.368375 -3.583265 -1.123245
H  -7.61397 -3.103735 0.100531
H  7.608513 -3.11275 -0.090949
