program: Gaussian 09
title: 000252589
version: EM64L-G09RevD.01
frameworkgroup: C1[X(C15H15ClO2)]
method: RPBEPBE
basis: SDD
operation: Freq
keyword: #p
keyword: freq=noraman
keyword: PBEPBE/SDD
title: #p freq=noraman PBEPBE/SDD
converged: YES YES NO NO
title: Mulliken charges:
elementType: Cl O O C C C C C C C C C C C C C C C H H H H H H H H H H H H H H H
charge: -0.067152 -0.301029 -0.267066 0.429564 -0.371301 -0.345237 0.407981 -0.400494 -0.388159 -0.388157 -0.380817 0.320057 -0.352712 -0.343574 -0.202890 -0.218128 -0.100063 -0.538677 0.199528 0.208240 0.204341 0.207695 0.229768 0.259233 0.281114 0.233648 0.249766 0.239517 0.254342 0.254469 0.221267 0.220532 0.244395
chargesum: 0.00000
title: Mulliken charges with hydrogens summed into heavy atoms:
elementType: Cl O O C C C C C C C C C C C C C C C
charge: -0.067152 -0.301029 -0.267066 0.429564 0.036467 0.066799 0.407981 -0.170726 -0.128926 -0.107043 -0.147169 0.320057 -0.102946 -0.104057 0.051452 0.036340 -0.100063 0.147517
polarizability: 2.51393427e+02 -1.54998309e+00 1.81431138e+02 1.59689174e+01 -7.52438737e-01 1.01393149e+02
1716.lowfreq: -3.4080 -1.5097 -0.0021 -0.0020 -0.0018 6.0103 16.7425 20.4952 26.8144
frequency: 16.6602 20.4538 26.7954 55.9613 76.8493 82.8847 111.2907 135.7764 165.4399 198.1447 225.6962 236.8016 270.4984 298.5647 333.9018 346.5756 365.5692 407.0731 412.8161 437.6176 478.7502 499.1479 511.4696 549.6137 625.0872 628.9624 646.2778 698.6823 709.9867 733.0608 799.2439 810.8809 819.0012 823.2204 836.9532 838.5356 935.0632 942.5617 943.2457 964.5218 976.2012 988.2743 999.7021 1002.6223 1006.0494 1024.1966 1056.3476 1071.5847 1108.6344 1112.4455 1113.4686 1156.3736 1175.8120 1180.4162 1190.3466 1201.3743 1216.8313 1219.7368 1234.0538 1287.3063 1300.8024 1319.2735 1362.3611 1384.6328 1392.7451 1408.0324 1419.2754 1436.4690 1464.5339 1466.5906 1473.5890 1478.9667 1483.5629 1505.4729 1587.5613 1589.7975 1606.5275 1627.7670 2895.7850 2904.3125 2943.0524 2952.9810 2958.2650 3045.2650 3119.0181 3123.7387 3124.1986 3147.8153 3159.6970 3165.4780 3169.4528 3169.6756 3180.5346
redmass: 3.8871 3.7154 6.9156 4.8657 4.0087 3.2719 4.0862 4.4981 3.5795 6.5772 3.6737 1.2320 4.5615 4.3806 3.4167 5.3352 5.7851 2.9101 2.9604 5.5146 2.9830 3.2683 3.5830 4.5057 7.0798 6.8818 5.6220 3.5213 3.2743 4.4400 3.2962 1.5812 1.4788 1.4123 1.4133 2.7691 2.5524 1.9825 1.3160 1.3526 1.3703 8.6584 4.0347 2.2758 2.0216 1.7880 7.3485 2.6763 1.3543 1.2671 1.3346 1.3391 1.2147 1.1164 1.0796 1.2056 2.2708 2.0054 3.8166 1.2864 1.3072 1.5056 3.3294 4.7473 3.0808 2.1146 2.7946 1.1701 1.1049 1.0505 1.0735 2.2305 1.1337 2.5224 7.2049 7.4894 6.1870 6.3986 1.0583 1.0578 1.1017 1.1001 1.0330 1.1038 1.0897 1.0899 1.0992 1.0873 1.0891 1.0948 1.0960 1.0952 1.0965
irintensity: 2.3795 0.0902 0.1145 0.6378 11.5138 10.6358 0.8471 1.3804 2.1487 0.4237 1.9631 0.1282 0.6475 0.2694 3.1496 2.2840 7.0546 0.2914 0.9200 5.0953 25.7034 10.5840 10.4590 20.5911 0.7426 3.8281 19.2494 1.0922 1.1626 6.2244 20.5232 30.2511 68.4544 39.0035 14.5235 0.7602 6.4974 6.8643 1.3431 0.6767 0.6724 46.4837 60.1138 5.8246 7.6851 14.3601 214.0318 26.4885 11.4686 1.0669 6.8137 0.2171 72.0516 0.7391 2.6271 6.0519 1.8407 72.3364 98.2884 22.1144 11.3238 46.4186 21.3491 13.3918 12.7939 1.0106 4.0200 9.6921 23.0396 13.6593 52.0452 75.3344 9.4376 106.5890 15.3659 1.7856 4.8226 45.7454 11.7043 112.4045 60.3615 33.3201 63.1117 50.2516 17.3800 12.9768 27.2902 7.4412 1.1003 13.7930 3.4540 5.6364 1.5120
temp: 298.150 k
press: 1.00000 atm
elementType: 17 8 8 6 6 6 6 6 6 6 6 6 6 6 6 6 6 6 1 1 1 1 1 1 1 1 1 1 1 1 1 1 1
symmnumber: 1
zpe: 680128.7 jmol-1
zpe.correction: 0.259047 hartree
zpe.thermalcorrener: 0.276219 hartree
zpe.thermalcorrenthalpy: 0.277164 hartree
zpe.thermalcorrgfe: 0.210239 hartree
zpe.sumelectzpe: -1189.766066 hartree
zpe.sumelectthermal: -1189.748894 hartree
zpe.sumelectthermalent: -1189.747949 hartree
zpe.sumelectthermalfe: -1189.814874 hartree
dipole: -1.8250 -1.5287 1.1604
dipole: 2.6484
quadrupole: -124.7280 -95.1246 -114.0110
quadrupole: -16.8831 -0.0929 1.2250
quadrupole: -13.4401 16.1632 -2.7231 -16.8831 -0.0929 1.2250
hfenergy: -1190.025113 hartree
pointgroup: C01 [X(C15H15Cl1O2)]
dipole: -0.702483 -0.6064505 0.4737275 debye
polarizability: 248.3916983|6.0623578|180.8998859|25.5223059|-7.1922099|104.92613 unknown
InChI: InChI=1S/C15H15ClO2/c1-17-15-8-4-13(5-9-15)11-18-10-12-2-6-14(16)7-3-12/h2-9H,10-11H2,1H3
charge 0 multiplicity 1
33 atoms
Cl 6.303547 2.313714 0.053287
O  0.378365 -1.011438 0.233748
O  -5.734446 0.828997 -0.565361
C  -2.036745 -1.17306 0.005513
C  -0.754042 -1.947763 0.229381
C  1.634852 -1.668605 0.589884
C  2.769888 -0.667746 0.472186
C  -3.135674 -1.783307 -0.652739
C  -2.181268 0.15122 0.477674
C  2.614572 0.526568 -0.271524
C  4.016029 -0.937382 1.090513
C  -4.483688 0.229505 -0.340923
C  -4.351616 -1.096768 -0.822612
C  -3.392349 0.859265 0.30761
C  3.685833 1.439372 -0.4027
C  5.098767 -0.039164 0.965241
C  4.912959 1.139165 0.21683
C  -5.914432 2.205037 -0.098175
H  -0.78221 -2.483295 1.207477
H  -0.61511 -2.712582 -0.566669
H  1.813662 -2.531522 -0.093693
H  1.579576 -2.072821 1.626086
H  -3.042251 -2.805382 -1.040867
H  -1.32885 0.633481 0.966096
H  1.647588 0.737437 -0.736024
H  4.152457 -1.852625 1.67987
H  -5.203822 -1.558814 -1.330041
H  -3.470141 1.886033 0.677898
H  3.565559 2.36358 -0.975388
H  6.060171 -0.247975 1.443205
H  -5.205397 2.895869 -0.595022
H  -5.792537 2.277708 1.000348
H  -6.945452 2.470195 -0.374711
