program: Gaussian 09
title: 000252586
version: EM64L-G09RevD.01
frameworkgroup: C1[X(C14H14O2S2)]
method: RPBEPBE
basis: SDD
operation: Freq
keyword: #p
keyword: freq=noraman
keyword: PBEPBE/SDD
title: #p freq=noraman PBEPBE/SDD
converged: YES YES NO NO
title: Mulliken charges:
elementType: S S O O C C C C C C C C C C C C C C H H H H H H H H H H H H H H
charge: 0.860412 0.010688 -0.532693 -0.512038 -0.799205 0.539003 -0.928716 0.526437 -0.342965 -0.343757 -0.418275 -0.357683 -0.212486 -0.213414 -0.221018 -0.227867 -0.220200 -0.237052 0.302160 0.293417 0.298934 0.329666 0.241301 0.248868 0.282353 0.236910 0.235212 0.236802 0.237375 0.228446 0.228360 0.231024
chargesum: 0.00000
title: Mulliken charges with hydrogens summed into heavy atoms:
elementType: S S O O C C C C C C C C C C C C C C
charge: 0.860412 0.010688 -0.532693 -0.512038 -0.203628 0.539003 -0.300117 0.526437 -0.101664 -0.094888 -0.135922 -0.120773 0.022725 0.023388 0.016357 0.000579 0.008159 -0.006028
polarizability: 3.10260342e+02 -2.69133770e+01 2.18316487e+02 -1.56996333e+01 1.75169067e+01 1.37377119e+02
1716.lowfreq: -9.2434 -4.6147 -2.1088 -0.0022 0.0010 0.0011 6.8997 16.8615 25.9387
frequency: 5.3278 16.8509 25.8974 48.6182 50.1753 70.5073 96.0540 121.7309 134.5990 165.9099 174.3411 196.7824 239.2914 285.6731 326.3604 331.5600 348.3134 395.4223 398.3672 402.5181 429.0544 462.6986 512.9907 553.3792 568.5754 614.1162 614.9279 629.2647 689.7181 704.5036 771.3900 773.4139 803.1331 807.1403 814.5707 840.6838 847.1310 857.7174 877.4374 930.5103 931.7877 945.6147 980.3642 982.3583 988.6257 988.7892 997.5558 1003.0016 1024.8813 1027.4600 1077.1304 1079.4518 1120.7529 1147.7924 1173.2526 1177.5792 1189.8615 1191.0603 1208.5027 1220.8371 1240.2147 1248.5830 1330.3905 1331.7001 1381.8794 1390.6614 1426.3926 1427.5385 1442.1655 1443.5113 1483.1082 1483.6694 1584.2504 1590.7168 1607.8360 1611.4454 2996.0475 3064.4116 3067.3688 3119.8707 3123.3723 3132.3078 3136.7764 3136.8467 3146.0804 3146.1513 3156.9731 3158.9616 3163.2991 3172.2272
redmass: 5.6974 4.0961 4.0360 4.8225 5.9272 7.0251 6.6160 8.0054 6.0095 11.4069 6.4438 8.2227 11.8900 6.7490 5.9991 2.0291 2.1275 8.1554 2.8482 2.9090 12.6337 4.0248 4.4885 5.1505 4.3852 6.3058 6.1753 5.0613 1.7008 1.7546 1.9750 1.9693 4.1399 13.0958 4.2195 1.6696 1.2570 1.2553 2.3002 1.4488 1.4357 3.1899 1.4014 1.3944 5.9948 5.9837 1.3156 1.3444 2.1896 2.2172 1.5511 1.5145 1.1378 1.0819 1.0526 1.0557 1.1245 1.1265 1.1555 2.7557 2.7114 1.2093 1.2801 1.2585 7.7612 8.7561 1.1821 1.1973 1.9518 2.2237 2.3319 2.2798 5.7996 6.0007 5.9234 5.9723 1.0599 1.0579 1.1028 1.0857 1.0877 1.0856 1.0907 1.0898 1.0950 1.0941 1.1116 1.0977 1.1015 1.1017
irintensity: 0.4101 0.0587 0.1386 0.3795 1.6245 2.8402 4.6152 1.8480 2.9865 0.4842 22.0488 1.1772 0.8899 2.2228 28.9738 7.0514 1.3338 68.6175 2.8910 1.5218 29.2460 5.3241 29.3620 7.7181 12.8705 0.1137 3.0479 21.4116 45.1874 63.1480 37.5133 19.6498 8.4452 64.4721 9.4066 2.8508 0.1824 1.7656 23.4925 11.9429 5.8078 37.8120 0.0378 0.4750 0.6648 1.4218 1.0333 0.2174 2.7795 4.7983 10.8597 13.7946 1.2973 1.6411 0.0309 0.1341 26.7352 0.7298 43.8624 7.3169 45.8755 14.7589 0.8056 0.1992 0.1501 1.6324 37.8037 5.5369 10.6894 13.9301 1.6858 12.0280 0.5128 1.3398 29.7384 3.7020 5.3348 3.4165 1.6615 3.6803 0.7815 1.3491 5.0344 3.3567 36.4851 2.3122 3.6784 19.6227 25.6576 25.7819
temp: 298.150 k
press: 1.00000 atm
elementType: 16 16 8 8 6 6 6 6 6 6 6 6 6 6 6 6 6 6 1 1 1 1 1 1 1 1 1 1 1 1 1 1
symmnumber: 1
zpe: 634846.7 jmol-1
zpe.correction: 0.241800 hartree
zpe.thermalcorrener: 0.259920 hartree
zpe.thermalcorrenthalpy: 0.260864 hartree
zpe.thermalcorrgfe: 0.190405 hartree
zpe.sumelectzpe: -1487.017868 hartree
zpe.sumelectthermal: -1486.999748 hartree
zpe.sumelectthermalent: -1486.998804 hartree
zpe.sumelectthermalfe: -1487.069263 hartree
dipole: -0.3220 4.8024 -2.3113
dipole: 5.3394
quadrupole: -100.6318 -125.3971 -123.7002
quadrupole: -8.3402 0.6210 5.5218
quadrupole: 15.9446 -8.8207 -7.1239 -8.3402 0.6210 5.5218
hfenergy: -1487.2596681 hartree
pointgroup: C01 [X(C14H14O2S2)]
dipole: -0.079259 0.922518 1.8855938 debye
polarizability: 302.1935792|38.9027792|211.5392382|9.6300492|38.0652889|152.2211306 unknown
InChI: InChI=1S/C7H7O2S.C7H7S/c8-10(9)6-7-4-2-1-3-5-7;8-6-7-4-2-1-3-5-7/h1-5H,6H2;1-5H,6H2
charge 0 multiplicity 1
32 atoms
S  0.724322 -1.418804 -1.581364
S  -1.369571 -2.74224 -1.411835
O  0.331488 -0.02663 -2.347626
O  1.944475 -2.329139 -2.149263
C  1.064759 -1.005168 0.393048
C  2.268244 -0.163346 0.540104
C  -2.490262 -1.272073 -1.884666
C  -2.936532 -0.430014 -0.713074
C  2.152183 1.255446 0.561326
C  3.557083 -0.760078 0.641031
C  -2.35114 0.844661 -0.488159
C  -3.945121 -0.888066 0.175094
C  3.300646 2.059559 0.70147
C  4.703367 0.047262 0.779523
C  4.5775 1.457313 0.812055
C  -2.766786 1.641675 0.603887
C  -4.358666 -0.093109 1.265908
C  -3.769683 1.17526 1.484741
H  0.100581 -0.536664 0.640186
H  1.139559 -2.036303 0.768242
H  -3.331595 -1.758399 -2.410162
H  -1.910226 -0.684845 -2.621033
H  1.162296 1.716032 0.464766
H  3.651936 -1.851041 0.599937
H  -1.577406 1.204068 -1.177069
H  -4.402326 -1.871688 0.011164
H  3.206651 3.150435 0.719945
H  5.69262 -0.415914 0.856269
H  5.470174 2.083639 0.917732
H  -2.316296 2.62871 0.76048
H  -5.140406 -0.457281 1.942035
H  -4.093967 1.793945 2.329009
