program: Gaussian 09
title: 000252585
version: EM64L-G09RevD.01
frameworkgroup: C1[X(C12H25NO2)]
method: RPBEPBE
basis: SDD
operation: Freq
keyword: #p
keyword: freq=noraman
keyword: PBEPBE/SDD
title: #p freq=noraman PBEPBE/SDD
converged: YES YES NO NO
title: Mulliken charges:
elementType: O O N C C C C C C C C C C C C H H H H H H H H H H H H H H H H H H H H H H H H H
charge: -0.327484 -0.303806 -0.420983 0.307248 -0.422158 0.311663 -0.727472 -0.713743 -0.730703 -0.784963 -0.719073 0.279625 0.050586 -0.684965 -0.688001 0.249347 0.186473 0.211573 0.220293 0.207321 0.228597 0.192354 0.203660 0.207812 0.207602 0.226601 0.225200 0.230577 0.213608 0.204861 0.263468 0.212808 0.319170 0.231664 0.208595 0.250764 0.215233 0.206047 0.231014 0.219588
chargesum: 0.00000
title: Mulliken charges with hydrogens summed into heavy atoms:
elementType: O O N C C C C C C C C C C C C
charge: -0.327484 -0.303806 -0.101813 0.307248 0.013662 0.311663 -0.088285 -0.089132 -0.088688 -0.115578 -0.037935 0.279625 0.282249 -0.010374 -0.031352
polarizability: 1.68936602e+02 -6.17574127e+00 1.38929526e+02 -5.45539535e-01 -1.59226261e+00 1.28133340e+02
1716.lowfreq: -8.1641 -0.0005 0.0002 0.0006 4.3248 10.2113 28.7142 36.1711 44.4887
frequency: 28.5842 35.9669 44.2970 75.2641 82.1888 113.7376 153.2459 188.7382 189.7077 205.2791 210.7095 230.9588 238.4817 242.1850 253.4977 269.9166 279.3537 289.8978 301.1182 306.0094 347.3253 357.8584 373.8203 387.5275 405.8599 413.7761 444.2626 458.7707 495.1261 530.7255 560.7453 694.4463 705.2284 729.2840 760.6530 813.1484 862.0470 893.4736 894.5682 917.0956 922.4486 923.3498 926.5561 936.3309 940.1369 940.9750 978.3045 1006.4051 1017.1369 1027.1245 1035.9944 1105.6153 1136.8387 1147.9643 1155.5660 1177.8449 1190.0884 1210.2641 1235.6994 1251.1172 1256.6512 1317.5645 1325.5102 1340.4877 1356.4435 1371.7460 1374.9319 1376.5562 1378.2357 1393.3515 1395.4628 1405.0135 1452.3715 1455.2393 1458.1617 1460.3473 1463.0052 1463.8713 1468.1398 1470.3845 1471.8715 1476.0551 1481.1778 1486.2747 1487.3606 1489.3907 1497.5224 1502.6329 1655.2133 2963.7815 2969.7040 2969.9313 2976.3388 2981.6182 2985.2084 2986.6291 2990.6525 3024.1816 3032.4429 3055.2164 3058.1398 3065.3667 3067.5211 3070.1222 3077.1729 3080.5400 3082.5996 3090.0345 3090.9415 3095.9259 3098.5396 3101.1054 3104.3177 3553.9210
redmass: 3.2071 3.0290 2.6326 5.5649 4.9610 3.3761 2.2031 1.0494 2.0248 1.8718 1.4951 1.5505 1.3888 1.0633 2.0976 1.0784 1.9528 1.2060 2.5548 2.1359 2.5663 2.2971 2.6507 3.1704 2.6192 2.0054 2.4131 2.2832 2.5270 1.1553 2.8370 6.3699 11.2964 3.7209 3.6154 2.9586 1.9618 2.9098 2.6503 2.0216 1.6997 1.2559 1.5217 1.4781 1.3340 1.3749 1.7796 1.4085 2.7622 1.5607 1.4120 1.8180 1.6776 2.2440 2.0512 2.0860 2.0549 2.7365 2.9856 3.4667 3.3187 1.3928 1.4884 1.3007 1.3303 1.1970 1.1998 1.2661 1.2097 1.2349 1.2342 1.2177 1.0868 1.0548 1.1023 1.0585 1.0496 1.0480 1.1273 1.1048 1.0529 1.0604 1.2326 1.0503 1.1102 1.0768 1.0733 1.0690 8.7239 1.0350 1.0493 1.0420 1.0417 1.0364 1.0354 1.0364 1.0357 1.0864 1.0994 1.0995 1.0992 1.0987 1.0993 1.0992 1.0989 1.0994 1.0999 1.0959 1.0988 1.1006 1.0987 1.1004 1.0997 1.0769
irintensity: 0.9812 0.0959 0.0598 8.6808 0.8449 1.5537 0.4964 0.0536 0.2635 2.9286 1.3701 0.3472 0.3751 0.1740 8.2552 0.4019 2.2293 0.0441 1.2253 0.5232 1.8869 1.1349 0.7573 7.6810 1.1742 0.3284 1.4453 0.0834 2.3273 105.9852 0.3694 7.1584 24.1712 0.3393 2.8985 0.1668 3.5946 11.1556 2.9554 19.3849 12.4320 2.2700 3.3592 2.4622 0.6407 2.7445 18.3671 25.2375 172.4169 35.8211 2.6062 160.0950 0.1651 40.0973 9.2808 105.6226 49.0398 2.2910 32.3289 79.5713 70.5892 6.1720 0.9198 7.8702 22.4424 2.7356 39.6507 33.4520 25.1056 27.2165 21.6282 17.8168 39.9530 6.6072 36.7428 3.7594 4.9702 2.6675 50.6162 33.3046 3.6907 36.1826 104.1640 32.0601 40.3014 22.1428 16.4573 21.4208 198.1207 30.3406 56.4470 20.9735 21.4135 22.0719 18.9258 33.6073 24.8270 7.4124 6.4466 6.7393 25.9923 73.6292 58.2197 40.2286 48.9723 6.6454 46.3317 33.5509 62.3589 19.8706 33.4124 36.0090 13.3504 24.9137
temp: 298.150 k
press: 1.00000 atm
elementType: 8 8 7 6 6 6 6 6 6 6 6 6 6 6 6 1 1 1 1 1 1 1 1 1 1 1 1 1 1 1 1 1 1 1 1 1 1 1 1 1
symmnumber: 1
zpe: 928024.4 jmol-1
zpe.correction: 0.353466 hartree
zpe.thermalcorrener: 0.372863 hartree
zpe.thermalcorrenthalpy: 0.373807 hartree
zpe.thermalcorrgfe: 0.306559 hartree
zpe.sumelectzpe: -676.250577 hartree
zpe.sumelectthermal: -676.231180 hartree
zpe.sumelectthermalent: -676.230236 hartree
zpe.sumelectthermalfe: -676.297484 hartree
dipole: -0.4506 0.2126 -1.9932
dipole: 2.0545
quadrupole: -86.7423 -93.1547 -98.9623
quadrupole: -3.5534 -0.9291 -1.5652
quadrupole: 6.2108 -0.2016 -6.0092 -3.5534 -0.9291 -1.5652
hfenergy: -676.6040433 hartree
pointgroup: C01 [X(C12H25N1O2)]
dipole: 0.1904843 -0.0802602 -0.7814154 debye
polarizability: 169.1291174|-5.64288|138.7120835|1.1281976|1.5190689|128.1582671 unknown
InChI: InChI=1S/C12H25NO2/c1-9(2)15-10(14)13-12(6,7)8-11(3,4)5/h9,13H,8H2,1-7H3
charge 0 multiplicity 1
40 atoms
O  -2.293517 -0.286032 -0.590728
O  -1.217641 -0.345506 1.514789
N  -0.141834 -0.990677 -0.486613
C  2.366619 1.173882 -0.017911
C  1.880251 -0.103672 0.753087
C  1.216607 -1.332072 0.039597
C  2.565199 2.277453 1.064022
C  1.338299 1.699223 -1.055296
C  3.739592 0.950058 -0.714276
C  2.01565 -1.875272 -1.169202
C  1.073374 -2.469071 1.092783
C  -1.19275 -0.531257 0.266061
C  -3.524732 0.265586 0.066131
C  -3.370578 1.784773 0.234527
C  -4.685519 -0.141819 -0.845385
H  1.149395 0.219204 1.519809
H  2.754127 -0.499851 1.310684
H  3.264863 1.93937 1.852151
H  1.604487 2.53221 1.549026
H  2.979198 3.199462 0.613468
H  0.345045 1.854634 -0.596392
H  1.212068 1.007032 -1.907286
H  1.681233 2.669879 -1.463168
H  4.104601 1.899002 -1.152299
H  4.497033 0.603351 0.014814
H  3.687106 0.207383 -1.528077
H  1.555604 -2.809789 -1.542076
H  3.052513 -2.101568 -0.869031
H  2.053621 -1.150783 -2.001994
H  2.070404 -2.801333 1.434183
H  0.497518 -2.117485 1.964948
H  0.54735 -3.334365 0.650415
H  -0.305069 -1.050143 -1.492905
H  -3.606158 -0.213978 1.05964
H  -4.285749 2.21255 0.684267
H  -2.521116 2.014772 0.899596
H  -3.205171 2.26732 -0.745536
H  -5.642783 0.205565 -0.415912
H  -4.728874 -1.238713 -0.957323
H  -4.570066 0.307278 -1.847887
